{"text_format":"1","workbook":"xlsx","n_sheets":10,"sheets":["Instrução de Uso","Resumo","AFP - Detalhada","AFP - Estimativa","AFP - Indicativa","Fundamentação","Redução de Prazo","Esforço","Tipo Projeto","Tipo Sistema"],"not_rendered":{"charts":1,"images":1,"macros":0,"external_links":0,"defined_names":8,"comments":6,"pivot_tables":0},"unopened":[],"bounds":{"document_bytes":16777216,"sheet_cells":100000,"rows_first":2000,"rows_last":500,"rows_between":2000,"halvings":0,"cell_chars":16384,"cell_head_chars":4096},"cells_cut":0,"cells_raw":0,"read":"whole","date_system":"1904"}

{"sheet":"Instrução de Uso","index":0,"n_rows":0,"n_cols":0,"rows_kept":0,"cut":false,"hidden":false,"merged":[]}

{"sheet":"Resumo","index":1,"n_rows":28,"n_cols":7,"rows_kept":28,"cut":false,"hidden":false,"merged":[[3,1,3,3],[3,5,3,6],[4,1,4,3],[4,5,4,6],[0,1,0,6],[2,0,2,6],[9,0,9,6],[11,0,11,6],[12,0,12,6],[5,1,5,3],[5,5,5,6],[6,1,6,3],[6,5,6,6],[8,0,8,6],[14,0,14,2],[15,0,15,1],[16,0,16,1],[17,4,17,5],[14,4,14,6],[15,4,16,6],[21,4,21,5],[22,4,22,5],[23,4,23,5],[22,0,23,2],[17,0,17,1],[18,4,18,5],[18,0,18,1],[19,4,19,5],[19,0,19,1],[20,4,20,5],[20,0,20,1],[24,0,25,2],[25,4,25,5],[26,0,26,1],[26,4,26,5],[27,0,27,1],[27,4,27,5]]}
["Template V.1.6","Contagem de Pontos de Função - SISP 2.0"]
[]
["Identificação"]
["O.S.:",null,null,null,"Tipo de Atividade:","Desenvolvimento ou Manutenção"]
["Tipo de Contagem:","Detalhada",null,null,"Aplicação:"]
["Elaborador da contagem:",{"$f":"IF($B$5=\"Detalhada\",IF('AFP - Detalhada'!N3<>\"\",'AFP - Detalhada'!N3,\"\"),IF($B$5=\"Estimativa\",IF('AFP - Estimativa'!I3<>\"\",'AFP - Estimativa'!I3,\"\"),IF($B$5=\"Indicativa\",IF('AFP - Indicativa'!H3<>\"\",'AFP - Indicativa'!H3,\"\"),\"\")))","v":""},null,null,"Data da Contagem:",{"$f":"IF($B$5=\"Detalhada\",IF('AFP - Detalhada'!N4<>\"\",'AFP - Detalhada'!N4,\"\"),IF($B$5=\"Estimativa\",IF('AFP - Estimativa'!I4<>\"\",'AFP - Estimativa'!I4,\"\"),IF($B$5=\"Indicativa\",IF('AFP - Indicativa'!H4<>\"\",'AFP - Indicativa'!H4,\"\"),\"\")))","v":""}]
["Revisor da contagem:",{"$f":"IF($B$5=\"Detalhada\",IF('AFP - Detalhada'!N5<>\"\",'AFP - Detalhada'!N5,\"\"),IF($B$5=\"Estimativa\",IF('AFP - Estimativa'!I5<>\"\",'AFP - Estimativa'!I5,\"\"),IF($B$5=\"Indicativa\",IF('AFP - Indicativa'!H5<>\"\",'AFP - Indicativa'!H5,\"\"),\"\")))","v":""},null,null,"Data da Revisão:",{"$f":"IF($B$5=\"Detalhada\",IF('AFP - Detalhada'!N6<>\"\",'AFP - Detalhada'!N6,\"\"),IF($B$5=\"Estimativa\",IF('AFP - Estimativa'!I6<>\"\",'AFP - Estimativa'!I6,\"\"),IF($B$5=\"Indicativa\",IF('AFP - Indicativa'!H6<>\"\",'AFP - Indicativa'!H6,\"\"),\"\")))","v":""}]
[]
["Propósito da Contagem"]
[]
[]
["Escopo da Contagem"]
[]
[]
["Quadro Resumo",null,null,null,"Projeto de Desenvolvimento e Manutenção"]
{"$rows_left_out":14}
{"sheet":"AFP - Detalhada","index":2,"n_rows":385,"n_cols":18,"rows_kept":385,"cut":false,"hidden":false,"merged":[[0,2,0,17],[4,0,5,2],[4,3,5,4],[3,13,3,17],[7,0,8,0],[7,8,7,16],[2,13,2,17],[4,13,4,17],[5,13,5,17],[3,8,3,10],[7,1,8,1],[7,4,8,4],[7,2,8,2],[7,7,8,7],[7,3,8,3],[9,0,9,17],[383,0,383,17],[2,8,2,10],[4,8,4,10],[7,17,8,17],[7,5,8,5],[7,6,8,6],[5,8,5,10],[6,0,6,17]]}
[{"$f":"Resumo!A1","v":"Template V.1.6"},null,"Contagem de Pontos de Função - SISP 2.0\nContagem Detalhada"]
[]
[null,null,null,null,null,null,null,null,"Elaborador da contagem:"]
[null,null,null,null,null,null,null,null,"Data da Contagem:"]
["Quantidade de Pontos de Função:",null,null,{"$f":"TEXT(Q385,\"#.##0,0#\")","v":"0,0"},null,null,null,null,"Revisor da contagem:"]
[null,null,null,null,null,null,null,null,"Data da Revisão:"]
[]
["ID","Tipo Projeto","Fator Ajuste","Item PT","Release","Módulo","Requisito","Processos elementares","Desenvolvimento",null,null,null,null,null,null,null,null,"Fund."]
[null,null,null,null,null,null,null,null,"DER","RL/AR","Tipo","C_T","C_D","Complexidade","PF_T","PF_D","PF"]
["Só inserir linhas depois desta."]
[null,null,{"$f":"IF(B11<>\"\",VLOOKUP(B11,'Tipo Projeto'!$A$3:$B$36,2,0),0)","v":0},null,null,null,null,null,null,null,null,{"$f":"IF(K11=\"EE\",IF(OR(AND(OR(J11=1,J11=0),I11>0,I11<5),AND(OR(J11=1,J11=0),I11>4,I11<16),AND(J11=2,I11>0,I11<5)),\"Simples\",IF(OR(AND(OR(J11=1,J11=0),I11>15),AND(J11=2,I11>4,I11<16),AND(J11>2,I11>0,I11<5)),\"Médio\",IF(OR(AND(J11=2,I11>15),AND(J11>2,I11>4,I11<16),AND(J11>2,I11>15)),\"Complexo\",\"\"))),\nIF(OR(K11=\"CE\",K11=\"SE\"),IF(OR(AND(OR(J11=1,J11=0),I11>0,I11<6),AND(OR(J11=1,J11=0),I11>5,I11<20),AND(J11>1,J11<4,I11>0,I11<6)),\"Simples\",IF(OR(AND(OR(J11=1,J11=0),I11>19),AND(J11>1,J11<4,I11>5,I11<20),AND(J11>3,I11>0,I11<6)),\"Médio\",IF(OR(AND(J11>1,J11<4,I11>19),AND(J11>3,I11>5,I11<20),AND(J11>3,I11>19)),\"Complexo\",\"\"))),\"\"))","v":""},{"$f":"IF(K11=\"ALI\",IF(OR(AND(OR(J11=1,J11=0),I11>0,I11<20),AND(OR(J11=1,J11=0),I11>19,I11<51),AND(J11>1,J11<6,I11>0,I11<20)),\"Simples\",IF(OR(AND(OR(J11=1,J11=0),I11>50),AND(J11>1,J11<6,I11>19,I11<51),AND(J11>5,I11>0,I11<20)),\"Médio\",IF(OR(AND(J11>1,J11<6,I11>50),AND(J11>5,I11>19,I11<51),AND(J11>5,I11>50)),\"Complexo\",\"\"))),\nIF(K11=\"AIE\",IF(OR(AND(OR(J11=1, J11=0),I11>0,I11<20),AND(OR(J11=1, J11=0),I11>19,I11<51),AND(J11>1,J11<6,I11>0,I11<20)),\"Simples\",IF(OR(AND(OR(J11=1, J11=0),I11>50),AND(J11>1,J11<6,I11>19,I11<51),AND(J11>5,I11>0,I11<20)),\"Médio\",IF(OR(AND(J11>1,J11<6,I11>50),AND(J11>5,I11>19,I11<51),AND(J11>5,I11>50)),\"Complexo\",\"\"))),\"\"))","v":""},{"$f":"IF(L11=\"\",M11,IF(M11=\"\",L11,\"\"))","v":""},{"$f":"IF(AND(OR(K11=\"EE\",K11=\"CE\"),N11=\"Simples\"),3,\nIF(AND(OR(K11=\"EE\",K11=\"CE\"),N11=\"Médio\"),4,\nIF(AND(OR(K11=\"EE\",K11=\"CE\"),N11=\"Complexo\"),6,\nIF(AND(K11=\"SE\",N11=\"Simples\"),4,\nIF(AND(K11=\"SE\",N11=\"Médio\"),5,\nIF(AND(K11=\"SE\",N11=\"Complexo\"),7,0))))))","v":0},{"$f":"IF(AND(K11=\"ALI\",M11=\"Simples\"),7,\nIF(AND(K11=\"ALI\",M11=\"Médio\"),10,\nIF(AND(K11=\"ALI\",M11=\"Complexo\"),15,\nIF(AND(K11=\"AIE\",M11=\"Simples\"),5,\nIF(AND(K11=\"AIE\",M11=\"Médio\"),7,\nIF(AND(K11=\"AIE\",M11=\"Complexo\"),10,0))))))","v":0},{"$f":"IF(B11<>\"Manutenção em interface\",IF(B11<>\"Desenv., Manutenção e Publicação de Páginas Estáticas\",(O11+P11)*C11,C11),C11)","v":0}]
[null,null,{"$f":"IF(B12<>\"\",VLOOKUP(B12,'Tipo Projeto'!$A$3:$B$36,2,0),0)","v":0},null,null,null,null,null,null,null,null,"","","",0,0,0]
[null,null,{"$f":"IF(B13<>\"\",VLOOKUP(B13,'Tipo Projeto'!$A$3:$B$36,2,0),0)","v":0},null,null,null,null,null,null,null,null,"","","",0,0,0]
[null,null,{"$f":"IF(B14<>\"\",VLOOKUP(B14,'Tipo Projeto'!$A$3:$B$36,2,0),0)","v":0},null,null,null,null,null,null,null,null,"","","",0,0,0]
[null,null,{"$f":"IF(B15<>\"\",VLOOKUP(B15,'Tipo Projeto'!$A$3:$B$36,2,0),0)","v":0},null,null,null,null,null,null,null,null,"","","",0,0,0]
{"$rows_left_out":371}
{"sheet":"AFP - Estimativa","index":3,"n_rows":384,"n_cols":11,"rows_kept":384,"cut":false,"hidden":false,"merged":[[0,2,0,10],[4,0,5,1],[4,2,5,3],[2,8,2,10],[4,8,4,10],[5,8,5,10],[1,0,1,1],[7,10,8,10],[3,8,3,10],[383,7,383,8],[7,1,8,1],[7,2,8,2],[7,7,8,7],[7,8,7,9],[9,0,9,10],[382,0,382,10],[7,0,8,0],[7,3,8,3],[7,4,8,4],[7,5,8,5],[7,6,8,6]]}
[{"$f":"Resumo!A1","v":"Template V.1.6"},null,"Contagem de Pontos de Função - SISP 2.0\nContagem Estimada"]
[]
[null,null,null,null,null,null,null,"Elaborador da contagem:"]
[null,null,null,null,null,null,null,"Data da Contagem:"]
["Quantidade de Pontos de Função:",null,{"$f":"TEXT(J384,\"#.##0,0#\")","v":"0,0"},null,null,null,null,"Revisor da contagem:"]
[null,null,null,null,null,null,null,"Data da Revisão:"]
[]
["ID","Tipo Projeto","Fator Ajuste","Item PT","Release","Módulo","Requisito","Processos elementares","Desenvolvimento",null,"Fund."]
[null,null,null,null,null,null,null,null,"Tipo","PF"]
["Só inserir linhas depois desta."]
[null,null,{"$f":"IF(B11<>\"\",VLOOKUP(B11,'Tipo Projeto'!$A$3:$B$36,2,0),0)","v":0},null,null,null,null,null,null,{"$f":"IF(B11<>\"Manutenção em interface\",IF(B11<>\"Desenv., Manutenção e Publicação de Páginas Estáticas\",IF(I11=\"EE\",4,IF(I11=\"CE\",4,IF(I11=\"SE\",5,IF(I11=\"ALI\",7,IF(I11=\"AIE\",5,0)))))*C11,C11),C11)","v":0}]
[null,null,{"$f":"IF(B12<>\"\",VLOOKUP(B12,'Tipo Projeto'!$A$3:$B$36,2,0),0)","v":0},null,null,null,null,null,null,0]
[null,null,{"$f":"IF(B13<>\"\",VLOOKUP(B13,'Tipo Projeto'!$A$3:$B$36,2,0),0)","v":0},null,null,null,null,null,null,0]
[null,null,{"$f":"IF(B14<>\"\",VLOOKUP(B14,'Tipo Projeto'!$A$3:$B$36,2,0),0)","v":0},null,null,null,null,null,null,0]
[null,null,{"$f":"IF(B15<>\"\",VLOOKUP(B15,'Tipo Projeto'!$A$3:$B$36,2,0),0)","v":0},null,null,null,null,null,null,0]
{"$rows_left_out":370}
{"sheet":"AFP - Indicativa","index":4,"n_rows":110,"n_cols":10,"rows_kept":110,"cut":false,"hidden":false,"merged":[[108,0,108,9],[106,4,106,5],[107,4,107,5],[0,4,0,9],[2,7,2,9],[3,7,3,9],[4,7,4,9],[5,7,5,9],[100,4,100,5],[101,4,101,5],[102,4,102,5],[103,4,103,5],[104,4,104,5],[105,4,105,5],[94,4,94,5],[95,4,95,5],[96,4,96,5],[97,4,97,5],[98,4,98,5],[99,4,99,5],[88,4,88,5],[89,4,89,5],[90,4,90,5],[91,4,91,5],[92,4,92,5],[93,4,93,5],[82,4,82,5],[83,4,83,5],[84,4,84,5],[85,4,85,5],[86,4,86,5],[87,4,87,5],[76,4,76,5],[77,4,77,5],[78,4,78,5],[79,4,79,5],[80,4,80,5],[81,4,81,5],[70,4,70,5],[71,4,71,5],[72,4,72,5],[73,4,73,5],[74,4,74,5],[75,4,75,5],[64,4,64,5],[65,4,65,5],[66,4,66,5],[67,4,67,5],[68,4,68,5],[69,4,69,5],[58,4,58,5],[59,4,59,5],[60,4,60,5],[61,4,61,5],[62,4,62,5],[63,4,63,5],[52,4,52,5],[53,4,53,5],[54,4,54,5],[55,4,55,5],[56,4,56,5],[57,4,57,5],[32,4,32,5],[33,4,33,5],[46,4,46,5],[47,4,47,5],[48,4,48,5],[49,4,49,5],[50,4,50,5],[51,4,51,5],[40,4,40,5],[41,4,41,5],[42,4,42,5],[43,4,43,5],[44,4,44,5],[45,4,45,5],[4,0,5,3],[4,4,5,4],[7,4,8,5],[22,4,22,5],[23,4,23,5],[24,4,24,5],[25,4,25,5],[26,4,26,5],[16,4,16,5],[17,4,17,5],[18,4,18,5],[19,4,19,5],[20,4,20,5],[21,4,21,5],[9,0,9,9],[7,9,8,9],[109,6,109,7],[7,0,8,0],[7,1,8,1],[7,2,8,2],[7,3,8,3],[7,6,8,6],[7,7,7,8],[10,4,10,5],[11,4,11,5],[12,4,12,5],[13,4,13,5],[14,4,14,5],[15,4,15,5],[27,4,27,5],[34,4,34,5],[35,4,35,5],[36,4,36,5],[37,4,37,5],[38,4,38,5],[39,4,39,5],[28,4,28,5],[29,4,29,5],[30,4,30,5],[31,4,31,5]]}
["Template V.1.1",null,null,null,"Contagem de Pontos de Função - SISP 2.0\nContagem Indicativa"]
[]
[null,null,null,null,null,null,"Elaborador da contagem:"]
[null,null,null,null,null,null,"Data da Contagem:"]
["Quantidade de Pontos de Função:",null,null,null,{"$f":"TEXT(I110,\"#.##0,0#\")","v":"0,0"},null,"Revisor da contagem:"]
[null,null,null,null,null,null,"Data da Revisão:"]
[]
["ID","Item PT","Release","Módulo","Requisito",null,"Arquivos Lógicos","Desenvolvimento",null,"Fund."]
[null,null,null,null,null,null,null,"Tipo","PF"]
["Só inserir linhas depois desta."]
[null,null,null,null,null,null,null,null,{"$f":"IF(H11=\"ALI\",35,IF(H11=\"AIE\",15,\"\"))","v":""}]
[null,null,null,null,null,null,null,null,""]
[null,null,null,null,null,null,null,null,""]
[null,null,null,null,null,null,null,null,""]
[null,null,null,null,null,null,null,null,""]
{"$rows_left_out":96}
{"sheet":"Fundamentação","index":5,"n_rows":6,"n_cols":3,"rows_kept":6,"cut":false,"hidden":false,"merged":[[2,0,2,2]]}
[{"$f":"Resumo!A1","v":"Template V.1.6"},null,"Contagem de Pontos de Função - SISP 2.0\nFundamentação"]
[]
["Fundamentação da Contagem"]
["ID","Título","Imagem Tela / Link documentação / Justificativa"]
[1]
[2]

{"sheet":"Redução de Prazo","index":6,"n_rows":115,"n_cols":19,"rows_kept":115,"cut":false,"hidden":false,"merged":[[0,3,0,17],[1,1,1,7],[2,1,2,5],[2,6,2,7],[3,1,3,5],[3,6,3,7],[4,6,5,6],[6,1,6,5],[6,6,6,7],[7,1,7,5],[7,6,7,7],[10,1,10,2],[8,1,9,2],[8,3,9,3],[8,4,9,4],[4,1,5,5],[11,1,11,2],[12,1,12,2],[13,1,13,2],[14,1,14,2],[15,1,15,2],[2,13,2,15],[2,16,2,17],[2,10,3,11],[2,9,4,9],[1,13,1,17],[1,9,1,11],[3,13,3,15],[3,16,3,17],[4,13,4,15],[4,16,4,17],[5,13,5,15],[5,16,5,17],[10,13,10,17],[7,13,7,15],[6,13,6,15],[16,5,16,7],[14,9,16,9],[14,10,16,11],[8,5,9,5],[8,6,8,7],[9,13,9,15],[8,13,8,15]]}
[null,{"$f":"Resumo!$A$1","v":"Template V.1.6"},null,"Contagem de Pontos de Função - SISP 2.0\nDistribuição de Esforço/ Redução de Prazo"]
[null,"DISTRIBUIÇÃO DE PRAZO DE PROJETO",null,null,null,null,null,null,null,{"$f":"IF(G4=\"SISP v1.0\",\"PRAZO SISP 1 ATÉ 99 PF\",\"PRAZO SISP 2/2.1 ATÉ 99 PF\")","v":"PRAZO SISP 2/2.1 ATÉ 99 PF"},null,null,null,"REDUÇÃO DE PRAZO"]
[null,"P1 - Informe o tipo de Prazo (Úteis/Corridos):",null,null,null,null,"Corridos",null,null,"Tamanho do Projeto",{"$f":"IF(G3=\"Úteis\", \"Prazo em dias úteis\",\"Prazo em dias corridos\")","v":"Prazo em dias corridos"},null,null,"DESCRIÇÃO",null,null,"VALORES"]
[null,"P2 - Informe a versão do SISP:",null,null,null,null,"SISP v2.0/2.1",null,null,null,null,null,null,"Data limite desejada"]
[null,"P3 - Informe Tipo do Sistema:",null,null,null,null,"Sistema OO","Expoent t para o Tipo:",null,null,"Complex.\nBaixa","Complex.\nMédia",null,"Prazo desejado p/conclusão (dias)",null,null,{"$f":"IF(AND(Q4<>\"\",B17<>0),(Q4-G11)+1,B17)","v":"Informe PF"}]
[null,null,null,null,null,null,null,{"$f":"IF(G5=\"Sistema Comum – Mainframe\", 0.33, IF(G5=\"Sistema Comum – WEB\", 0.35, IF(G5=\"Sistema OO\", 0.36, IF(G5=\"Sistema Cliente/Servidor (Alta complexidade)\", 0.37,IF(G5=\"Sistemas Gerenciais Complexos\", 0.39, IF(G5=\"Software Básico, Framework, Sistemas Comerciais\", 0.4, IF(G5=\"Software Militar *Exclusivo SISP v2.0\", 0.45, \"ERRO - Selecione o Tipo novamente\")))))))","v":0.36},null,"Até 10 PF",{"$f":"ROUND(IF(G3=\"Úteis\",IF(G4=\"SISP v1.0\",10,9),IF(G4=\"SISP v1.0\",10*(7/5),9*(7/5))),0)","v":13},{"$f":"ROUND(IF(G3=\"Úteis\",IF(G4=\"SISP v1.0\",10,15),IF(G4=\"SISP v1.0\",10*(7/5),15*(7/5))),0)","v":21},null,"Taxa de redução do prazo-projeto",null,null,{"$f":"IF(G8<>0,Q5/B17-1,\"-\")","v":"-"}]
[null,"P4 - Informe a complexidade do projeto:",null,null,null,null,"Projetos com até 99 PF - Complexidade Média ou Alta",null,null,"De 11 PF a 20 PF",{"$f":"ROUND(IF(G3=\"Úteis\",IF(G4=\"SISP v1.0\",20,18),IF(G4=\"SISP v1.0\",20*(7/5),18*(7/5))),0)","v":25},{"$f":"ROUND(IF(G3=\"Úteis\",IF(G4=\"SISP v1.0\",20,30),IF(G4=\"SISP v1.0\",20*(7/5),30*(7/5))),0)","v":42},null,null,null,null,"SISP","LINEAR"]
[null,"P5 - Informe o tamanho do Projeto em PF:",null,null,null,null,null,null,null,"De 21 PF a 30 PF",{"$f":"ROUND(IF(G3=\"Úteis\",IF(G4=\"SISP v1.0\",30,27),IF(G4=\"SISP v1.0\",30*(7/5),27*(7/5))),0)","v":38},{"$f":"ROUND(IF(G3=\"Úteis\",IF(G4=\"SISP v1.0\",30,45),IF(G4=\"SISP v1.0\",30*(7/5),45*(7/5))),0)","v":63},null,"Taxa de aumento de esforço",null,null,{"$f":"IF(Q5=B17,\"-\",GROWTH(R22:R24,Q22:Q24,Q6,1))","v":"-"},{"$f":"IF(Q5=B17,\"-\",TREND(R22:R24,Q22:Q24,Q6,0))","v":"-"}]
[null,"Fases do Projeto",null,"% SISP","% OS","Dias","Cronograma",null,null,"De 31 PF a 40 PF",{"$f":"ROUND(IF(G3=\"Úteis\",IF(G4=\"SISP v1.0\",40,36),IF(G4=\"SISP v1.0\",40*(7/5),36*(7/5))),0)","v":50},{"$f":"ROUND(IF(G3=\"Úteis\",IF(G4=\"SISP v1.0\",40,60),IF(G4=\"SISP v1.0\",40*(7/5),60*(7/5))),0)","v":84},null,"Índice multiplicador de esforço",null,null,{"$f":"IF(Q5=B17,\"-\",Q8/100+1)","v":"-"},{"$f":"IF(Q5=B17,\"-\",R8/100+1)","v":"-"}]
[null,null,null,null,null,null,"Início","Fim",null,"De 41 PF a 50 PF",{"$f":"ROUND(IF(G3=\"Úteis\",IF(G4=\"SISP v1.0\",50,45),IF(G4=\"SISP v1.0\",50*(7/5),45*(7/5))),0)","v":63},{"$f":"ROUND(IF(G3=\"Úteis\",IF(G4=\"SISP v1.0\",50,75),IF(G4=\"SISP v1.0\",50*(7/5),75*(7/5))),0)","v":105},null,"Novo Tamanho Funcional (PF)",null,null,{"$f":"IF(Q5=B17,\"-\",(Q8/100+1)*G8)","v":"-"},{"$f":"IF(Q5=B17,\"-\",(R8/100+1)*G8)","v":"-"}]
[null,"Engenharia de Requisitos",null,0.25,0.25,{"$f":"IF(ISERR($B$17*E11),\"ERRO\",$B$17*E11)","v":"ERRO"},null,{"$f":"IF(E11=\"\",G11,(IF(G11=\"\",\"-\",IF(ISERR(IF(AND((G11>=0),(G11<=2958465)),G11+(F11-1),\"-\")),\"-\",IF(AND((G11>=0),(G11<=2958465)),G11+(F11-1),\"-\")))))","v":"-"},null,"De 51 PF a 60 PF",{"$f":"ROUND(IF(G3=\"Úteis\",IF(G4=\"SISP v1.0\",60,54),IF(G4=\"SISP v1.0\",60*(7/5),54*(7/5))),0)","v":76},{"$f":"ROUND(IF(G3=\"Úteis\",IF(G4=\"SISP v1.0\",60,90),IF(G4=\"SISP v1.0\",60*(7/5),90*(7/5))),0)","v":126},null,"CRONOGRAMA COM REDUÇÃO DE PRAZO"]
[null,"Arquitetura & Design",null,{"$f":"IF(G4=\"SISP v1.0\",15%,10%)","v":0.1},0.1,{"$f":"IF(ISERR($B$17*E12),\"ERRO\",$B$17*E12)","v":"ERRO"},{"$f":"IF(AND((H11>=0),(H11<=2958465)),H11,\"-\")","v":"-"},{"$f":"IF(G12=\"\", \"-\",(IF(AND((G12>=0),(G12<=2958465)),G12+(F12),\"-\")))","v":"-"},null,"De 61 PF a 70 PF",{"$f":"ROUND(IF(G3=\"Úteis\",IF(G4=\"SISP v1.0\",70,63),IF(G4=\"SISP v1.0\",70*(7/5),63*(7/5))),0)","v":88},{"$f":"ROUND(IF(G3=\"Úteis\",IF(G4=\"SISP v1.0\",70,105),IF(G4=\"SISP v1.0\",70*(7/5),105*(7/5))),0)","v":147},null,"Fases do Projeto","% OS","Dias","Data Início","Data Fim"]
[null,"Implementação",null,0.4,0.4,"ERRO",{"$f":"IF(AND((H12>=0),(H12<=2958465)),H12,\"-\")","v":"-"},{"$f":"IF(G13=\"\", \"-\",(IF(AND((G13>=0),(G13<=2958465)),G13+(F13),\"-\")))","v":"-"},null,"De 71 PF a 85 PF",{"$f":"ROUND(IF(G3=\"Úteis\",IF(G4=\"SISP v1.0\",88,70),IF(G4=\"SISP v1.0\",88*(7/5),70*(7/5))),0)","v":98},{"$f":"ROUND(IF(G3=\"Úteis\",IF(G4=\"SISP v1.0\",88,110),IF(G4=\"SISP v1.0\",88*(7/5),110*(7/5))),0)","v":154},null,"Engenharia de Requisitos",{"$f":"E11","v":0.25},{"$f":"IF(Q5=B17,\"-\",IF(AND($G$8<>0,$G$11<>\"\"),$Q$5*O13,\"-\"))","v":"-"},{"$f":"IF(Q5=B17,\"-\",IF(G11=\"\",\"-\",G11))","v":"-"},{"$f":"IF(Q13<>\"-\",(IF(P13>1,((Q13+P13)-1),(Q13+P13))),\"-\")","v":"-"}]
[null,"Testes",null,{"$f":"IF(G4=\"SISP v1.0\",10%,15%)","v":0.15},0.15,"ERRO",{"$f":"IF(AND((H13>=0),(H13<=2958465)),H13,\"-\")","v":"-"},{"$f":"IF(G14=\"\", \"-\",(IF(AND((G14>=0),(G14<=2958465)),G14+(F14),\"-\")))","v":"-"},null,"De 86 PF a 99 PF",{"$f":"ROUND(IF(G3=\"Úteis\",IF(G4=\"SISP v1.0\",104,79),IF(G4=\"SISP v1.0\",104*(7/5),79*(7/5))),0)","v":111},{"$f":"ROUND(IF(G3=\"Úteis\",IF(G4=\"SISP v1.0\",104,110),IF(G4=\"SISP v1.0\",104*(7/5),110*(7/5))),0)","v":154},null,"Arquitetura & Design",0.1,{"$f":"IF(Q5=B17,\"-\",IF(AND($G$8<>0,$G$11<>\"\"),$Q$5*O14,\"-\"))","v":"-"},{"$f":"R13","v":"-"},{"$f":"IF(Q14<>\"-\",Q14+P14,\"-\")","v":"-"}]
[null,"Homologação",null,0.05,0.05,"ERRO",{"$f":"IF(AND((H14>=0),(H14<=2958465)),H14,\"-\")","v":"-"},{"$f":"IF(G15=\"\", \"-\",(IF(AND((G15>=0),(G15<=2958465)),G15+(F15),\"-\")))","v":"-"},null,"+ de 99 PF","Cálculo pela fórmula de Capers Jones: \nTd = V^t",null,null,"Implementação",0.4,{"$f":"IF(Q5=B17,\"-\",IF(AND($G$8<>0,$G$11<>\"\"),$Q$5*O15,\"-\"))","v":"-"},{"$f":"R14","v":"-"},"-"]
{"$rows_left_out":101}
{"sheet":"Esforço","index":7,"n_rows":24,"n_cols":9,"rows_kept":24,"cut":false,"hidden":false,"merged":[[0,2,0,8]]}
[{"$f":"Resumo!A1","v":"Template V.1.6"},null,"Contagem de Pontos de Função - SISP 2.0\nEsforço"]
[]
["Produtividade (h/PFs) ----------->",null,8]
[null,null,null,"Engenharia de Requisitos","Design e Arquitetura","Implementação","Testes","Homologação","Implantação"]
["Requisito","Quant. PF","Total",{"$f":"Resumo!G18","v":0.25},{"$f":"Resumo!G19","v":0.1},{"$f":"Resumo!G20","v":0.4},{"$f":"Resumo!G21","v":0.15},{"$f":"Resumo!G22","v":0.05},{"$f":"Resumo!G23","v":0.05}]
[null,{"$f":"IF(Resumo!$B$5=\"Detalhada\",SUMIF('AFP - Detalhada'!$G$10:$G$384,Esforço!A6,'AFP - Detalhada'!$Q$10:$Q$384),IF(Resumo!B5=\"Estimativa\",SUMIF('AFP - Estimativa'!$G$10:$G$383,Esforço!A6,'AFP - Estimativa'!$J$10:$J$383)*(1+'AFP - Estimativa'!$C$6),IF(Resumo!B5=\"Indicativa\",SUMIF('AFP - Indicativa'!$E$10:$E$109,Esforço!A6,'AFP - Indicativa'!$I$10:$I$109)*(1+'AFP - Indicativa'!$E$6),0)))","v":0},{"$f":"ROUND(B6*$C$3,0)","v":0},{"$f":"ROUND($C6*D$5,0)","v":0},0,0,0,0,0]
[null,{"$f":"IF(Resumo!$B$5=\"Detalhada\",SUMIF('AFP - Detalhada'!$G$10:$G$384,Esforço!A7,'AFP - Detalhada'!$Q$10:$Q$384),IF(Resumo!B6=\"Estimativa\",SUMIF('AFP - Estimativa'!$G$10:$G$383,Esforço!A7,'AFP - Estimativa'!$J$10:$J$383)*(1+'AFP - Estimativa'!$C$6),IF(Resumo!B6=\"Indicativa\",SUMIF('AFP - Indicativa'!$E$10:$E$109,Esforço!A7,'AFP - Indicativa'!$I$10:$I$109)*(1+'AFP - Indicativa'!$E$6),0)))","v":0},{"$f":"ROUND(B7*$C$3,0)","v":0},0,0,0,0,0,0]
[null,{"$f":"IF(Resumo!$B$5=\"Detalhada\",SUMIF('AFP - Detalhada'!$G$10:$G$384,Esforço!A8,'AFP - Detalhada'!$Q$10:$Q$384),IF(Resumo!B7=\"Estimativa\",SUMIF('AFP - Estimativa'!$G$10:$G$383,Esforço!A8,'AFP - Estimativa'!$J$10:$J$383)*(1+'AFP - Estimativa'!$C$6),IF(Resumo!B7=\"Indicativa\",SUMIF('AFP - Indicativa'!$E$10:$E$109,Esforço!A8,'AFP - Indicativa'!$I$10:$I$109)*(1+'AFP - Indicativa'!$E$6),0)))","v":0},0,0,0,0,0,0,0]
[null,{"$f":"IF(Resumo!$B$5=\"Detalhada\",SUMIF('AFP - Detalhada'!$G$10:$G$384,Esforço!A9,'AFP - Detalhada'!$Q$10:$Q$384),IF(Resumo!B8=\"Estimativa\",SUMIF('AFP - Estimativa'!$G$10:$G$383,Esforço!A9,'AFP - Estimativa'!$J$10:$J$383)*(1+'AFP - Estimativa'!$C$6),IF(Resumo!B8=\"Indicativa\",SUMIF('AFP - Indicativa'!$E$10:$E$109,Esforço!A9,'AFP - Indicativa'!$I$10:$I$109)*(1+'AFP - Indicativa'!$E$6),0)))","v":0},0,0,0,0,0,0,0]
[null,{"$f":"IF(Resumo!$B$5=\"Detalhada\",SUMIF('AFP - Detalhada'!$G$10:$G$384,Esforço!A10,'AFP - Detalhada'!$Q$10:$Q$384),IF(Resumo!B9=\"Estimativa\",SUMIF('AFP - Estimativa'!$G$10:$G$383,Esforço!A10,'AFP - Estimativa'!$J$10:$J$383)*(1+'AFP - Estimativa'!$C$6),IF(Resumo!B9=\"Indicativa\",SUMIF('AFP - Indicativa'!$E$10:$E$109,Esforço!A10,'AFP - Indicativa'!$I$10:$I$109)*(1+'AFP - Indicativa'!$E$6),0)))","v":0},0,0,0,0,0,0,0]
[null,{"$f":"IF(Resumo!$B$5=\"Detalhada\",SUMIF('AFP - Detalhada'!$G$10:$G$384,Esforço!A11,'AFP - Detalhada'!$Q$10:$Q$384),IF(Resumo!B10=\"Estimativa\",SUMIF('AFP - Estimativa'!$G$10:$G$383,Esforço!A11,'AFP - Estimativa'!$J$10:$J$383)*(1+'AFP - Estimativa'!$C$6),IF(Resumo!B10=\"Indicativa\",SUMIF('AFP - Indicativa'!$E$10:$E$109,Esforço!A11,'AFP - Indicativa'!$I$10:$I$109)*(1+'AFP - Indicativa'!$E$6),0)))","v":0},0,0,0,0,0,0,0]
[null,{"$f":"IF(Resumo!$B$5=\"Detalhada\",SUMIF('AFP - Detalhada'!$G$10:$G$384,Esforço!A12,'AFP - Detalhada'!$Q$10:$Q$384),IF(Resumo!B11=\"Estimativa\",SUMIF('AFP - Estimativa'!$G$10:$G$383,Esforço!A12,'AFP - Estimativa'!$J$10:$J$383)*(1+'AFP - Estimativa'!$C$6),IF(Resumo!B11=\"Indicativa\",SUMIF('AFP - Indicativa'!$E$10:$E$109,Esforço!A12,'AFP - Indicativa'!$I$10:$I$109)*(1+'AFP - Indicativa'!$E$6),0)))","v":0},0,0,0,0,0,0,0]
[null,{"$f":"IF(Resumo!$B$5=\"Detalhada\",SUMIF('AFP - Detalhada'!$G$10:$G$384,Esforço!A13,'AFP - Detalhada'!$Q$10:$Q$384),IF(Resumo!B12=\"Estimativa\",SUMIF('AFP - Estimativa'!$G$10:$G$383,Esforço!A13,'AFP - Estimativa'!$J$10:$J$383)*(1+'AFP - Estimativa'!$C$6),IF(Resumo!B12=\"Indicativa\",SUMIF('AFP - Indicativa'!$E$10:$E$109,Esforço!A13,'AFP - Indicativa'!$I$10:$I$109)*(1+'AFP - Indicativa'!$E$6),0)))","v":0},0,0,0,0,0,0,0]
[null,{"$f":"IF(Resumo!$B$5=\"Detalhada\",SUMIF('AFP - Detalhada'!$G$10:$G$384,Esforço!A14,'AFP - Detalhada'!$Q$10:$Q$384),IF(Resumo!B13=\"Estimativa\",SUMIF('AFP - Estimativa'!$G$10:$G$383,Esforço!A14,'AFP - Estimativa'!$J$10:$J$383)*(1+'AFP - Estimativa'!$C$6),IF(Resumo!B13=\"Indicativa\",SUMIF('AFP - Indicativa'!$E$10:$E$109,Esforço!A14,'AFP - Indicativa'!$I$10:$I$109)*(1+'AFP - Indicativa'!$E$6),0)))","v":0},0,0,0,0,0,0,0]
[null,{"$f":"IF(Resumo!$B$5=\"Detalhada\",SUMIF('AFP - Detalhada'!$G$10:$G$384,Esforço!A15,'AFP - Detalhada'!$Q$10:$Q$384),IF(Resumo!B14=\"Estimativa\",SUMIF('AFP - Estimativa'!$G$10:$G$383,Esforço!A15,'AFP - Estimativa'!$J$10:$J$383)*(1+'AFP - Estimativa'!$C$6),IF(Resumo!B14=\"Indicativa\",SUMIF('AFP - Indicativa'!$E$10:$E$109,Esforço!A15,'AFP - Indicativa'!$I$10:$I$109)*(1+'AFP - Indicativa'!$E$6),0)))","v":0},0,0,0,0,0,0,0]
{"$rows_left_out":10}
{"sheet":"Tipo Projeto","index":8,"n_rows":37,"n_cols":2,"rows_kept":37,"cut":false,"hidden":true,"merged":[[0,0,0,1]]}
["Identificação da Manutenção"]
["Tipo","Fator de Ajuste"]
["Aplicação",1]
["Novo sistema",1]
["Melhoria – Nova",1]
["Melhoria – Alterada - Basis",0.5]
["Melhoria – Alterada - não Basis (sem redocumentação)",0.75]
["Melhoria – Alterada - não Basis (com redocumentação)",0.9]
["Melhoria – Excluída",0.4]
["Migração de Dados",1]
["Corretiva – Basis (na garantia)",0]
["Corretiva – Basis (fora da garantia)",0.5]
["Corretiva – Basis (fora da garantia com redocumentação)",0.65]
["Corretiva – Não Basis",0.75]
["Corretiva – Não Basis com redocumentação",0.9]
{"$rows_left_out":23}
{"sheet":"Tipo Sistema","index":9,"n_rows":8,"n_cols":3,"rows_kept":8,"cut":false,"hidden":true,"merged":[]}
["Tipo de Sistema","Observação","Expoente"]
["Sistema Comum – Mainframe","Desenvolvimento de sistema com alto grau de reuso ou manutenção evolutiva",0.33]
["Sistema Comum – WEB ou Cliente Servidor",null,0.35]
["Sistema OO","Se o projeto OO não for novidade para equipe, não tiver o desenvolvimento de componentes reusáveis, considerar sistema comum",0.36]
["Sistema Cliente/Servidor","Com alta complexidade arquitetural e integração com outros sistemas",0.37]
["Sistemas Gerenciais complexos","Com muitas integrações, Datawarehousing, Geoprocessamento, Workflow",0.39]
["Software Básico, Frameworks, Sistemas Comerciais",null,0.4]
["Software Militar",null,0.45]