{"text_format":"1","workbook":"xlsx","n_sheets":10,"sheets":["Instrução de Uso","Resumo","AFP - Detalhada","AFP - Estimativa","AFP - Indicativa","Fundamentação","Redução de Prazo","Esforço","Tipo Projeto","Tipo Sistema"],"not_rendered":{"charts":1,"images":1,"macros":0,"external_links":0,"defined_names":8,"comments":6,"pivot_tables":0},"unopened":[],"bounds":{"document_bytes":16777216,"sheet_cells":100000,"rows_first":2000,"rows_last":500,"rows_between":2000,"halvings":0,"cell_chars":16384,"cell_head_chars":4096},"cells_cut":0,"cells_raw":0,"read":"whole","date_system":"1904"}

{"sheet":"Instrução de Uso","index":0,"n_rows":0,"n_cols":0,"rows_kept":0,"cut":false,"hidden":false,"merged":[]}

{"sheet":"Resumo","index":1,"n_rows":28,"n_cols":7,"rows_kept":28,"cut":false,"hidden":false,"merged":[[3,1,3,3],[3,5,3,6],[4,1,4,3],[4,5,4,6],[0,1,0,6],[2,0,2,6],[9,0,9,6],[11,0,11,6],[12,0,12,6],[5,1,5,3],[5,5,5,6],[6,1,6,3],[6,5,6,6],[8,0,8,6],[14,0,14,2],[15,0,15,1],[16,0,16,1],[17,4,17,5],[14,4,14,6],[15,4,16,6],[21,4,21,5],[22,4,22,5],[23,4,23,5],[22,0,23,2],[17,0,17,1],[18,4,18,5],[18,0,18,1],[19,4,19,5],[19,0,19,1],[20,4,20,5],[20,0,20,1],[24,0,25,2],[25,4,25,5],[26,0,26,1],[26,4,26,5],[27,0,27,1],[27,4,27,5]]}
["Template V.1.6","Contagem de Pontos de Função - SISP 2.0"]
[]
["Identificação"]
["O.S.:",null,null,null,"Tipo de Atividade:","Desenvolvimento ou Manutenção"]
["Tipo de Contagem:","Detalhada",null,null,"Aplicação:"]
["Elaborador da contagem:",{"$f":"IF($B$5=\"Detalhada\",IF('AFP - Detalhada'!N3<>\"\",'AFP - Detalhada'!N3,\"\"),IF($B$5=\"Estimativa\",IF('AFP - Estimativa'!I3<>\"\",'AFP - Estimativa'!I3,\"\"),IF($B$5=\"Indicativa\",IF('AFP - Indicativa'!H3<>\"\",'AFP - Indicativa'!H3,\"\"),\"\")))","v":""},null,null,"Data da Contagem:",{"$f":"IF($B$5=\"Detalhada\",IF('AFP - Detalhada'!N4<>\"\",'AFP - Detalhada'!N4,\"\"),IF($B$5=\"Estimativa\",IF('AFP - Estimativa'!I4<>\"\",'AFP - Estimativa'!I4,\"\"),IF($B$5=\"Indicativa\",IF('AFP - Indicativa'!H4<>\"\",'AFP - Indicativa'!H4,\"\"),\"\")))","v":""}]
["Revisor da contagem:",{"$f":"IF($B$5=\"Detalhada\",IF('AFP - Detalhada'!N5<>\"\",'AFP - Detalhada'!N5,\"\"),IF($B$5=\"Estimativa\",IF('AFP - Estimativa'!I5<>\"\",'AFP - Estimativa'!I5,\"\"),IF($B$5=\"Indicativa\",IF('AFP - Indicativa'!H5<>\"\",'AFP - Indicativa'!H5,\"\"),\"\")))","v":""},null,null,"Data da Revisão:",{"$f":"IF($B$5=\"Detalhada\",IF('AFP - Detalhada'!N6<>\"\",'AFP - Detalhada'!N6,\"\"),IF($B$5=\"Estimativa\",IF('AFP - Estimativa'!I6<>\"\",'AFP - Estimativa'!I6,\"\"),IF($B$5=\"Indicativa\",IF('AFP - Indicativa'!H6<>\"\",'AFP - Indicativa'!H6,\"\"),\"\")))","v":""}]
[]
["Propósito da Contagem"]
[]
[]
["Escopo da Contagem"]
[]
[]
["Quadro Resumo",null,null,null,"Projeto de Desenvolvimento e Manutenção"]
["Arquivo Lógico Interno (ALI)",null,{"$f":"IF($B$5=\"Detalhada\",SUMIF('AFP - Detalhada'!$K$10:$K$384,\"ALI\",'AFP - Detalhada'!$Q$10:$Q$384),IF($B$5=\"Estimativa\",SUMIF('AFP - Estimativa'!$I$10:$I$383,\"ALI\",'AFP - Estimativa'!$J$10:$J$383)*(1+'AFP - Estimativa'!$C$6),IF($B$5=\"Indicativa\",SUMIF('AFP - Indicativa'!$H$10:$H$109,\"ALI\",'AFP - Indicativa'!$I$10:$I$109)*(1+'AFP - Indicativa'!$F$6))))","v":0},null,"Distribuição de Esforço por Fase do Projeto \n(conforme item 6.1.2.1 do SISP 2.0)"]
["Arquivo de Interface Externa (AIE)",null,{"$f":"IF($B$5=\"Detalhada\",SUMIF('AFP - Detalhada'!$K$10:$K$384,\"AIE\",'AFP - Detalhada'!$Q$10:$Q$384),IF($B$5=\"Estimativa\",SUMIF('AFP - Estimativa'!$I$10:$I$383,\"AIE\",'AFP - Estimativa'!$J$10:$J$383)*(1+'AFP - Estimativa'!$C$6),IF($B$5=\"Indicativa\",SUMIF('AFP - Indicativa'!$H$10:$H$109,\"AIE\",'AFP - Indicativa'!$I$10:$I$109)*(1+'AFP - Indicativa'!$F$6))))","v":0}]
["Consulta Externa (CE)",null,{"$f":"IF($B$5=\"Detalhada\",SUMIF('AFP - Detalhada'!$K$10:$K$384,\"CE\",'AFP - Detalhada'!$Q$10:$Q$384),IF($B$5=\"Estimativa\",SUMIF('AFP - Estimativa'!$I$10:$I$383,\"CE\",'AFP - Estimativa'!$J$10:$J$383)*(1+'AFP - Estimativa'!$C$6),\"\"))","v":0},null,"Engenharia de Requisitos",null,0.25]
["Entrada Externa (EE)",null,{"$f":"IF($B$5=\"Detalhada\",SUMIF('AFP - Detalhada'!$K$10:$K$384,\"EE\",'AFP - Detalhada'!$Q$10:$Q$384),IF($B$5=\"Estimativa\",SUMIF('AFP - Estimativa'!$I$10:$I$383,\"EE\",'AFP - Estimativa'!$J$10:$J$383)*(1+'AFP - Estimativa'!$C$6),\"\"))","v":0},null,"Design e Arquitetura",null,0.1]
["Saída Externa (SE)",null,{"$f":"IF($B$5=\"Detalhada\",SUMIF('AFP - Detalhada'!$K$10:$K$384,\"SE\",'AFP - Detalhada'!$Q$10:$Q$384),IF($B$5=\"Estimativa\",SUMIF('AFP - Estimativa'!$I$10:$I$383,\"SE\",'AFP - Estimativa'!$J$10:$J$383)*(1+'AFP - Estimativa'!$C$6),\"\"))","v":0},null,"Implementação",null,0.4]
["Total (A)",null,{"$f":"SUM(C16:C20)","v":0},null,"Testes",null,0.15]
[null,null,null,null,"Homologação",null,0.05]
["Projeto de Redocumentação de Requisitos",null,null,null,"Implantação",null,0.05]
[null,null,null,null,"Percentual de Esforço (E)",null,{"$f":"SUM(G18:G23)","v":1}]
["Distribuição de Esforço conforme item 4.11 do SISP"]
[null,null,null,null,{"$f":"CONCATENATE(\"Quantidade Final (A) x \",IF(F4<>\"\",IF(F4=\"Desenvolvimento ou manutenção\",\"(E1)\",\"(E2)\"),\"\"))","v":"Quantidade Final (A) x (E1)"},null,{"$f":"C21*IF(F4<>\"\",IF(F4=\"Desenvolvimento ou manutenção\",G24,C28),0)","v":0}]
["Redocumentação somente requisitos",null,0.2,null,"Fator de criticidade",null,1]
["Percentual de Esforço (E2)",null,{"$f":"SUM(C27:C27)","v":0.2},null,"Quantidade Final Ajustada",null,{"$f":"G26*G27","v":0}]

{"sheet":"AFP - Detalhada","index":2,"n_rows":385,"n_cols":18,"rows_kept":385,"cut":false,"hidden":false,"merged":[[0,2,0,17],[4,0,5,2],[4,3,5,4],[3,13,3,17],[7,0,8,0],[7,8,7,16],[2,13,2,17],[4,13,4,17],[5,13,5,17],[3,8,3,10],[7,1,8,1],[7,4,8,4],[7,2,8,2],[7,7,8,7],[7,3,8,3],[9,0,9,17],[383,0,383,17],[2,8,2,10],[4,8,4,10],[7,17,8,17],[7,5,8,5],[7,6,8,6],[5,8,5,10],[6,0,6,17]]}
[{"$f":"Resumo!A1","v":"Template V.1.6"},null,"Contagem de Pontos de Função - SISP 2.0\nContagem Detalhada"]
[]
[null,null,null,null,null,null,null,null,"Elaborador da contagem:"]
[null,null,null,null,null,null,null,null,"Data da Contagem:"]
["Quantidade de Pontos de Função:",null,null,{"$f":"TEXT(Q385,\"#.##0,0#\")","v":"0,0"},null,null,null,null,"Revisor da contagem:"]
[null,null,null,null,null,null,null,null,"Data da Revisão:"]
[]
["ID","Tipo Projeto","Fator Ajuste","Item PT","Release","Módulo","Requisito","Processos elementares","Desenvolvimento",null,null,null,null,null,null,null,null,"Fund."]
[null,null,null,null,null,null,null,null,"DER","RL/AR","Tipo","C_T","C_D","Complexidade","PF_T","PF_D","PF"]
["Só inserir linhas depois desta."]
[null,null,{"$f":"IF(B11<>\"\",VLOOKUP(B11,'Tipo Projeto'!$A$3:$B$36,2,0),0)","v":0},null,null,null,null,null,null,null,null,{"$f":"IF(K11=\"EE\",IF(OR(AND(OR(J11=1,J11=0),I11>0,I11<5),AND(OR(J11=1,J11=0),I11>4,I11<16),AND(J11=2,I11>0,I11<5)),\"Simples\",IF(OR(AND(OR(J11=1,J11=0),I11>15),AND(J11=2,I11>4,I11<16),AND(J11>2,I11>0,I11<5)),\"Médio\",IF(OR(AND(J11=2,I11>15),AND(J11>2,I11>4,I11<16),AND(J11>2,I11>15)),\"Complexo\",\"\"))),\nIF(OR(K11=\"CE\",K11=\"SE\"),IF(OR(AND(OR(J11=1,J11=0),I11>0,I11<6),AND(OR(J11=1,J11=0),I11>5,I11<20),AND(J11>1,J11<4,I11>0,I11<6)),\"Simples\",IF(OR(AND(OR(J11=1,J11=0),I11>19),AND(J11>1,J11<4,I11>5,I11<20),AND(J11>3,I11>0,I11<6)),\"Médio\",IF(OR(AND(J11>1,J11<4,I11>19),AND(J11>3,I11>5,I11<20),AND(J11>3,I11>19)),\"Complexo\",\"\"))),\"\"))","v":""},{"$f":"IF(K11=\"ALI\",IF(OR(AND(OR(J11=1,J11=0),I11>0,I11<20),AND(OR(J11=1,J11=0),I11>19,I11<51),AND(J11>1,J11<6,I11>0,I11<20)),\"Simples\",IF(OR(AND(OR(J11=1,J11=0),I11>50),AND(J11>1,J11<6,I11>19,I11<51),AND(J11>5,I11>0,I11<20)),\"Médio\",IF(OR(AND(J11>1,J11<6,I11>50),AND(J11>5,I11>19,I11<51),AND(J11>5,I11>50)),\"Complexo\",\"\"))),\nIF(K11=\"AIE\",IF(OR(AND(OR(J11=1, J11=0),I11>0,I11<20),AND(OR(J11=1, J11=0),I11>19,I11<51),AND(J11>1,J11<6,I11>0,I11<20)),\"Simples\",IF(OR(AND(OR(J11=1, J11=0),I11>50),AND(J11>1,J11<6,I11>19,I11<51),AND(J11>5,I11>0,I11<20)),\"Médio\",IF(OR(AND(J11>1,J11<6,I11>50),AND(J11>5,I11>19,I11<51),AND(J11>5,I11>50)),\"Complexo\",\"\"))),\"\"))","v":""},{"$f":"IF(L11=\"\",M11,IF(M11=\"\",L11,\"\"))","v":""},{"$f":"IF(AND(OR(K11=\"EE\",K11=\"CE\"),N11=\"Simples\"),3,\nIF(AND(OR(K11=\"EE\",K11=\"CE\"),N11=\"Médio\"),4,\nIF(AND(OR(K11=\"EE\",K11=\"CE\"),N11=\"Complexo\"),6,\nIF(AND(K11=\"SE\",N11=\"Simples\"),4,\nIF(AND(K11=\"SE\",N11=\"Médio\"),5,\nIF(AND(K11=\"SE\",N11=\"Complexo\"),7,0))))))","v":0},{"$f":"IF(AND(K11=\"ALI\",M11=\"Simples\"),7,\nIF(AND(K11=\"ALI\",M11=\"Médio\"),10,\nIF(AND(K11=\"ALI\",M11=\"Complexo\"),15,\nIF(AND(K11=\"AIE\",M11=\"Simples\"),5,\nIF(AND(K11=\"AIE\",M11=\"Médio\"),7,\nIF(AND(K11=\"AIE\",M11=\"Complexo\"),10,0))))))","v":0},{"$f":"IF(B11<>\"Manutenção em interface\",IF(B11<>\"Desenv., Manutenção e Publicação de Páginas Estáticas\",(O11+P11)*C11,C11),C11)","v":0}]
[null,null,{"$f":"IF(B12<>\"\",VLOOKUP(B12,'Tipo Projeto'!$A$3:$B$36,2,0),0)","v":0},null,null,null,null,null,null,null,null,"","","",0,0,0]
[null,null,{"$f":"IF(B13<>\"\",VLOOKUP(B13,'Tipo Projeto'!$A$3:$B$36,2,0),0)","v":0},null,null,null,null,null,null,null,null,"","","",0,0,0]
[null,null,{"$f":"IF(B14<>\"\",VLOOKUP(B14,'Tipo Projeto'!$A$3:$B$36,2,0),0)","v":0},null,null,null,null,null,null,null,null,"","","",0,0,0]
[null,null,{"$f":"IF(B15<>\"\",VLOOKUP(B15,'Tipo Projeto'!$A$3:$B$36,2,0),0)","v":0},null,null,null,null,null,null,null,null,"","","",0,0,0]
[null,null,{"$f":"IF(B16<>\"\",VLOOKUP(B16,'Tipo Projeto'!$A$3:$B$36,2,0),0)","v":0},null,null,null,null,null,null,null,null,"","","",0,0,0]
[null,null,{"$f":"IF(B17<>\"\",VLOOKUP(B17,'Tipo Projeto'!$A$3:$B$36,2,0),0)","v":0},null,null,null,null,null,null,null,null,"","","",0,0,0]
[null,null,{"$f":"IF(B18<>\"\",VLOOKUP(B18,'Tipo Projeto'!$A$3:$B$36,2,0),0)","v":0},null,null,null,null,null,null,null,null,"","","",0,0,0]
[null,null,{"$f":"IF(B19<>\"\",VLOOKUP(B19,'Tipo Projeto'!$A$3:$B$36,2,0),0)","v":0},null,null,null,null,null,null,null,null,"","","",0,0,0]
[null,null,{"$f":"IF(B20<>\"\",VLOOKUP(B20,'Tipo Projeto'!$A$3:$B$36,2,0),0)","v":0},null,null,null,null,null,null,null,null,"","","",0,0,0]
[null,null,{"$f":"IF(B21<>\"\",VLOOKUP(B21,'Tipo Projeto'!$A$3:$B$36,2,0),0)","v":0},null,null,null,null,null,null,null,null,"","","",0,0,0]
[null,null,{"$f":"IF(B22<>\"\",VLOOKUP(B22,'Tipo Projeto'!$A$3:$B$36,2,0),0)","v":0},null,null,null,null,null,null,null,null,{"$f":"IF(K22=\"EE\",IF(OR(AND(OR(J22=1,J22=0),I22>0,I22<5),AND(OR(J22=1,J22=0),I22>4,I22<16),AND(J22=2,I22>0,I22<5)),\"Simples\",IF(OR(AND(OR(J22=1,J22=0),I22>15),AND(J22=2,I22>4,I22<16),AND(J22>2,I22>0,I22<5)),\"Médio\",IF(OR(AND(J22=2,I22>15),AND(J22>2,I22>4,I22<16),AND(J22>2,I22>15)),\"Complexo\",\"\"))),\nIF(OR(K22=\"CE\",K22=\"SE\"),IF(OR(AND(OR(J22=1,J22=0),I22>0,I22<6),AND(OR(J22=1,J22=0),I22>5,I22<20),AND(J22>1,J22<4,I22>0,I22<6)),\"Simples\",IF(OR(AND(OR(J22=1,J22=0),I22>19),AND(J22>1,J22<4,I22>5,I22<20),AND(J22>3,I22>0,I22<6)),\"Médio\",IF(OR(AND(J22>1,J22<4,I22>19),AND(J22>3,I22>5,I22<20),AND(J22>3,I22>19)),\"Complexo\",\"\"))),\"\"))","v":""},{"$f":"IF(K22=\"ALI\",IF(OR(AND(OR(J22=1,J22=0),I22>0,I22<20),AND(OR(J22=1,J22=0),I22>19,I22<51),AND(J22>1,J22<6,I22>0,I22<20)),\"Simples\",IF(OR(AND(OR(J22=1,J22=0),I22>50),AND(J22>1,J22<6,I22>19,I22<51),AND(J22>5,I22>0,I22<20)),\"Médio\",IF(OR(AND(J22>1,J22<6,I22>50),AND(J22>5,I22>19,I22<51),AND(J22>5,I22>50)),\"Complexo\",\"\"))),\nIF(K22=\"AIE\",IF(OR(AND(OR(J22=1, J22=0),I22>0,I22<20),AND(OR(J22=1, J22=0),I22>19,I22<51),AND(J22>1,J22<6,I22>0,I22<20)),\"Simples\",IF(OR(AND(OR(J22=1, J22=0),I22>50),AND(J22>1,J22<6,I22>19,I22<51),AND(J22>5,I22>0,I22<20)),\"Médio\",IF(OR(AND(J22>1,J22<6,I22>50),AND(J22>5,I22>19,I22<51),AND(J22>5,I22>50)),\"Complexo\",\"\"))),\"\"))","v":""},{"$f":"IF(L22=\"\",M22,IF(M22=\"\",L22,\"\"))","v":""},{"$f":"IF(AND(OR(K22=\"EE\",K22=\"CE\"),N22=\"Simples\"),3,\nIF(AND(OR(K22=\"EE\",K22=\"CE\"),N22=\"Médio\"),4,\nIF(AND(OR(K22=\"EE\",K22=\"CE\"),N22=\"Complexo\"),6,\nIF(AND(K22=\"SE\",N22=\"Simples\"),4,\nIF(AND(K22=\"SE\",N22=\"Médio\"),5,\nIF(AND(K22=\"SE\",N22=\"Complexo\"),7,0))))))","v":0},{"$f":"IF(AND(K22=\"ALI\",M22=\"Simples\"),7,\nIF(AND(K22=\"ALI\",M22=\"Médio\"),10,\nIF(AND(K22=\"ALI\",M22=\"Complexo\"),15,\nIF(AND(K22=\"AIE\",M22=\"Simples\"),5,\nIF(AND(K22=\"AIE\",M22=\"Médio\"),7,\nIF(AND(K22=\"AIE\",M22=\"Complexo\"),10,0))))))","v":0},0]
[null,null,{"$f":"IF(B23<>\"\",VLOOKUP(B23,'Tipo Projeto'!$A$3:$B$36,2,0),0)","v":0},null,null,null,null,null,null,null,null,"","","",0,0,0]
[null,null,{"$f":"IF(B24<>\"\",VLOOKUP(B24,'Tipo Projeto'!$A$3:$B$36,2,0),0)","v":0},null,null,null,null,null,null,null,null,"","","",0,0,0]
[null,null,{"$f":"IF(B25<>\"\",VLOOKUP(B25,'Tipo Projeto'!$A$3:$B$36,2,0),0)","v":0},null,null,null,null,null,null,null,null,"","","",0,0,0]
[null,null,{"$f":"IF(B26<>\"\",VLOOKUP(B26,'Tipo Projeto'!$A$3:$B$36,2,0),0)","v":0},null,null,null,null,null,null,null,null,"","","",0,0,0]
[null,null,{"$f":"IF(B27<>\"\",VLOOKUP(B27,'Tipo Projeto'!$A$3:$B$36,2,0),0)","v":0},null,null,null,null,null,null,null,null,"","","",0,0,0]
[null,null,{"$f":"IF(B28<>\"\",VLOOKUP(B28,'Tipo Projeto'!$A$3:$B$36,2,0),0)","v":0},null,null,null,null,null,null,null,null,"","","",0,0,0]
[null,null,{"$f":"IF(B29<>\"\",VLOOKUP(B29,'Tipo Projeto'!$A$3:$B$36,2,0),0)","v":0},null,null,null,null,null,null,null,null,{"$f":"IF(K29=\"EE\",IF(OR(AND(OR(J29=1,J29=0),I29>0,I29<5),AND(OR(J29=1,J29=0),I29>4,I29<16),AND(J29=2,I29>0,I29<5)),\"Simples\",IF(OR(AND(OR(J29=1,J29=0),I29>15),AND(J29=2,I29>4,I29<16),AND(J29>2,I29>0,I29<5)),\"Médio\",IF(OR(AND(J29=2,I29>15),AND(J29>2,I29>4,I29<16),AND(J29>2,I29>15)),\"Complexo\",\"\"))),\nIF(OR(K29=\"CE\",K29=\"SE\"),IF(OR(AND(OR(J29=1,J29=0),I29>0,I29<6),AND(OR(J29=1,J29=0),I29>5,I29<20),AND(J29>1,J29<4,I29>0,I29<6)),\"Simples\",IF(OR(AND(OR(J29=1,J29=0),I29>19),AND(J29>1,J29<4,I29>5,I29<20),AND(J29>3,I29>0,I29<6)),\"Médio\",IF(OR(AND(J29>1,J29<4,I29>19),AND(J29>3,I29>5,I29<20),AND(J29>3,I29>19)),\"Complexo\",\"\"))),\"\"))","v":""},{"$f":"IF(K29=\"ALI\",IF(OR(AND(OR(J29=1,J29=0),I29>0,I29<20),AND(OR(J29=1,J29=0),I29>19,I29<51),AND(J29>1,J29<6,I29>0,I29<20)),\"Simples\",IF(OR(AND(OR(J29=1,J29=0),I29>50),AND(J29>1,J29<6,I29>19,I29<51),AND(J29>5,I29>0,I29<20)),\"Médio\",IF(OR(AND(J29>1,J29<6,I29>50),AND(J29>5,I29>19,I29<51),AND(J29>5,I29>50)),\"Complexo\",\"\"))),\nIF(K29=\"AIE\",IF(OR(AND(OR(J29=1, J29=0),I29>0,I29<20),AND(OR(J29=1, J29=0),I29>19,I29<51),AND(J29>1,J29<6,I29>0,I29<20)),\"Simples\",IF(OR(AND(OR(J29=1, J29=0),I29>50),AND(J29>1,J29<6,I29>19,I29<51),AND(J29>5,I29>0,I29<20)),\"Médio\",IF(OR(AND(J29>1,J29<6,I29>50),AND(J29>5,I29>19,I29<51),AND(J29>5,I29>50)),\"Complexo\",\"\"))),\"\"))","v":""},{"$f":"IF(L29=\"\",M29,IF(M29=\"\",L29,\"\"))","v":""},{"$f":"IF(AND(OR(K29=\"EE\",K29=\"CE\"),N29=\"Simples\"),3,\nIF(AND(OR(K29=\"EE\",K29=\"CE\"),N29=\"Médio\"),4,\nIF(AND(OR(K29=\"EE\",K29=\"CE\"),N29=\"Complexo\"),6,\nIF(AND(K29=\"SE\",N29=\"Simples\"),4,\nIF(AND(K29=\"SE\",N29=\"Médio\"),5,\nIF(AND(K29=\"SE\",N29=\"Complexo\"),7,0))))))","v":0},{"$f":"IF(AND(K29=\"ALI\",M29=\"Simples\"),7,\nIF(AND(K29=\"ALI\",M29=\"Médio\"),10,\nIF(AND(K29=\"ALI\",M29=\"Complexo\"),15,\nIF(AND(K29=\"AIE\",M29=\"Simples\"),5,\nIF(AND(K29=\"AIE\",M29=\"Médio\"),7,\nIF(AND(K29=\"AIE\",M29=\"Complexo\"),10,0))))))","v":0},0]
[null,null,{"$f":"IF(B30<>\"\",VLOOKUP(B30,'Tipo Projeto'!$A$3:$B$36,2,0),0)","v":0},null,null,null,null,null,null,null,null,"","","",0,0,0]
[null,null,{"$f":"IF(B31<>\"\",VLOOKUP(B31,'Tipo Projeto'!$A$3:$B$36,2,0),0)","v":0},null,null,null,null,null,null,null,null,{"$f":"IF(K31=\"EE\",IF(OR(AND(OR(J31=1,J31=0),I31>0,I31<5),AND(OR(J31=1,J31=0),I31>4,I31<16),AND(J31=2,I31>0,I31<5)),\"Simples\",IF(OR(AND(OR(J31=1,J31=0),I31>15),AND(J31=2,I31>4,I31<16),AND(J31>2,I31>0,I31<5)),\"Médio\",IF(OR(AND(J31=2,I31>15),AND(J31>2,I31>4,I31<16),AND(J31>2,I31>15)),\"Complexo\",\"\"))),\nIF(OR(K31=\"CE\",K31=\"SE\"),IF(OR(AND(OR(J31=1,J31=0),I31>0,I31<6),AND(OR(J31=1,J31=0),I31>5,I31<20),AND(J31>1,J31<4,I31>0,I31<6)),\"Simples\",IF(OR(AND(OR(J31=1,J31=0),I31>19),AND(J31>1,J31<4,I31>5,I31<20),AND(J31>3,I31>0,I31<6)),\"Médio\",IF(OR(AND(J31>1,J31<4,I31>19),AND(J31>3,I31>5,I31<20),AND(J31>3,I31>19)),\"Complexo\",\"\"))),\"\"))","v":""},{"$f":"IF(K31=\"ALI\",IF(OR(AND(OR(J31=1,J31=0),I31>0,I31<20),AND(OR(J31=1,J31=0),I31>19,I31<51),AND(J31>1,J31<6,I31>0,I31<20)),\"Simples\",IF(OR(AND(OR(J31=1,J31=0),I31>50),AND(J31>1,J31<6,I31>19,I31<51),AND(J31>5,I31>0,I31<20)),\"Médio\",IF(OR(AND(J31>1,J31<6,I31>50),AND(J31>5,I31>19,I31<51),AND(J31>5,I31>50)),\"Complexo\",\"\"))),\nIF(K31=\"AIE\",IF(OR(AND(OR(J31=1, J31=0),I31>0,I31<20),AND(OR(J31=1, J31=0),I31>19,I31<51),AND(J31>1,J31<6,I31>0,I31<20)),\"Simples\",IF(OR(AND(OR(J31=1, J31=0),I31>50),AND(J31>1,J31<6,I31>19,I31<51),AND(J31>5,I31>0,I31<20)),\"Médio\",IF(OR(AND(J31>1,J31<6,I31>50),AND(J31>5,I31>19,I31<51),AND(J31>5,I31>50)),\"Complexo\",\"\"))),\"\"))","v":""},{"$f":"IF(L31=\"\",M31,IF(M31=\"\",L31,\"\"))","v":""},{"$f":"IF(AND(OR(K31=\"EE\",K31=\"CE\"),N31=\"Simples\"),3,\nIF(AND(OR(K31=\"EE\",K31=\"CE\"),N31=\"Médio\"),4,\nIF(AND(OR(K31=\"EE\",K31=\"CE\"),N31=\"Complexo\"),6,\nIF(AND(K31=\"SE\",N31=\"Simples\"),4,\nIF(AND(K31=\"SE\",N31=\"Médio\"),5,\nIF(AND(K31=\"SE\",N31=\"Complexo\"),7,0))))))","v":0},{"$f":"IF(AND(K31=\"ALI\",M31=\"Simples\"),7,\nIF(AND(K31=\"ALI\",M31=\"Médio\"),10,\nIF(AND(K31=\"ALI\",M31=\"Complexo\"),15,\nIF(AND(K31=\"AIE\",M31=\"Simples\"),5,\nIF(AND(K31=\"AIE\",M31=\"Médio\"),7,\nIF(AND(K31=\"AIE\",M31=\"Complexo\"),10,0))))))","v":0},0]
[null,null,{"$f":"IF(B32<>\"\",VLOOKUP(B32,'Tipo Projeto'!$A$3:$B$36,2,0),0)","v":0},null,null,null,null,null,null,null,null,{"$f":"IF(K32=\"EE\",IF(OR(AND(OR(J32=1,J32=0),I32>0,I32<5),AND(OR(J32=1,J32=0),I32>4,I32<16),AND(J32=2,I32>0,I32<5)),\"Simples\",IF(OR(AND(OR(J32=1,J32=0),I32>15),AND(J32=2,I32>4,I32<16),AND(J32>2,I32>0,I32<5)),\"Médio\",IF(OR(AND(J32=2,I32>15),AND(J32>2,I32>4,I32<16),AND(J32>2,I32>15)),\"Complexo\",\"\"))),\nIF(OR(K32=\"CE\",K32=\"SE\"),IF(OR(AND(OR(J32=1,J32=0),I32>0,I32<6),AND(OR(J32=1,J32=0),I32>5,I32<20),AND(J32>1,J32<4,I32>0,I32<6)),\"Simples\",IF(OR(AND(OR(J32=1,J32=0),I32>19),AND(J32>1,J32<4,I32>5,I32<20),AND(J32>3,I32>0,I32<6)),\"Médio\",IF(OR(AND(J32>1,J32<4,I32>19),AND(J32>3,I32>5,I32<20),AND(J32>3,I32>19)),\"Complexo\",\"\"))),\"\"))","v":""},{"$f":"IF(K32=\"ALI\",IF(OR(AND(OR(J32=1,J32=0),I32>0,I32<20),AND(OR(J32=1,J32=0),I32>19,I32<51),AND(J32>1,J32<6,I32>0,I32<20)),\"Simples\",IF(OR(AND(OR(J32=1,J32=0),I32>50),AND(J32>1,J32<6,I32>19,I32<51),AND(J32>5,I32>0,I32<20)),\"Médio\",IF(OR(AND(J32>1,J32<6,I32>50),AND(J32>5,I32>19,I32<51),AND(J32>5,I32>50)),\"Complexo\",\"\"))),\nIF(K32=\"AIE\",IF(OR(AND(OR(J32=1, J32=0),I32>0,I32<20),AND(OR(J32=1, J32=0),I32>19,I32<51),AND(J32>1,J32<6,I32>0,I32<20)),\"Simples\",IF(OR(AND(OR(J32=1, J32=0),I32>50),AND(J32>1,J32<6,I32>19,I32<51),AND(J32>5,I32>0,I32<20)),\"Médio\",IF(OR(AND(J32>1,J32<6,I32>50),AND(J32>5,I32>19,I32<51),AND(J32>5,I32>50)),\"Complexo\",\"\"))),\"\"))","v":""},{"$f":"IF(L32=\"\",M32,IF(M32=\"\",L32,\"\"))","v":""},{"$f":"IF(AND(OR(K32=\"EE\",K32=\"CE\"),N32=\"Simples\"),3,\nIF(AND(OR(K32=\"EE\",K32=\"CE\"),N32=\"Médio\"),4,\nIF(AND(OR(K32=\"EE\",K32=\"CE\"),N32=\"Complexo\"),6,\nIF(AND(K32=\"SE\",N32=\"Simples\"),4,\nIF(AND(K32=\"SE\",N32=\"Médio\"),5,\nIF(AND(K32=\"SE\",N32=\"Complexo\"),7,0))))))","v":0},{"$f":"IF(AND(K32=\"ALI\",M32=\"Simples\"),7,\nIF(AND(K32=\"ALI\",M32=\"Médio\"),10,\nIF(AND(K32=\"ALI\",M32=\"Complexo\"),15,\nIF(AND(K32=\"AIE\",M32=\"Simples\"),5,\nIF(AND(K32=\"AIE\",M32=\"Médio\"),7,\nIF(AND(K32=\"AIE\",M32=\"Complexo\"),10,0))))))","v":0},0]
[null,null,{"$f":"IF(B33<>\"\",VLOOKUP(B33,'Tipo Projeto'!$A$3:$B$36,2,0),0)","v":0},null,null,null,null,null,null,null,null,"","","",0,0,0]
[null,null,{"$f":"IF(B34<>\"\",VLOOKUP(B34,'Tipo Projeto'!$A$3:$B$36,2,0),0)","v":0},null,null,null,null,null,null,null,null,"","","",0,0,0]
[null,null,{"$f":"IF(B35<>\"\",VLOOKUP(B35,'Tipo Projeto'!$A$3:$B$36,2,0),0)","v":0},null,null,null,null,null,null,null,null,"","","",0,0,0]
[null,null,{"$f":"IF(B36<>\"\",VLOOKUP(B36,'Tipo Projeto'!$A$3:$B$36,2,0),0)","v":0},null,null,null,null,null,null,null,null,"","","",0,0,0]
[null,null,{"$f":"IF(B37<>\"\",VLOOKUP(B37,'Tipo Projeto'!$A$3:$B$36,2,0),0)","v":0},null,null,null,null,null,null,null,null,"","","",0,0,0]
[null,null,{"$f":"IF(B38<>\"\",VLOOKUP(B38,'Tipo Projeto'!$A$3:$B$36,2,0),0)","v":0},null,null,null,null,null,null,null,null,{"$f":"IF(K38=\"EE\",IF(OR(AND(OR(J38=1,J38=0),I38>0,I38<5),AND(OR(J38=1,J38=0),I38>4,I38<16),AND(J38=2,I38>0,I38<5)),\"Simples\",IF(OR(AND(OR(J38=1,J38=0),I38>15),AND(J38=2,I38>4,I38<16),AND(J38>2,I38>0,I38<5)),\"Médio\",IF(OR(AND(J38=2,I38>15),AND(J38>2,I38>4,I38<16),AND(J38>2,I38>15)),\"Complexo\",\"\"))),\nIF(OR(K38=\"CE\",K38=\"SE\"),IF(OR(AND(OR(J38=1,J38=0),I38>0,I38<6),AND(OR(J38=1,J38=0),I38>5,I38<20),AND(J38>1,J38<4,I38>0,I38<6)),\"Simples\",IF(OR(AND(OR(J38=1,J38=0),I38>19),AND(J38>1,J38<4,I38>5,I38<20),AND(J38>3,I38>0,I38<6)),\"Médio\",IF(OR(AND(J38>1,J38<4,I38>19),AND(J38>3,I38>5,I38<20),AND(J38>3,I38>19)),\"Complexo\",\"\"))),\"\"))","v":""},{"$f":"IF(K38=\"ALI\",IF(OR(AND(OR(J38=1,J38=0),I38>0,I38<20),AND(OR(J38=1,J38=0),I38>19,I38<51),AND(J38>1,J38<6,I38>0,I38<20)),\"Simples\",IF(OR(AND(OR(J38=1,J38=0),I38>50),AND(J38>1,J38<6,I38>19,I38<51),AND(J38>5,I38>0,I38<20)),\"Médio\",IF(OR(AND(J38>1,J38<6,I38>50),AND(J38>5,I38>19,I38<51),AND(J38>5,I38>50)),\"Complexo\",\"\"))),\nIF(K38=\"AIE\",IF(OR(AND(OR(J38=1, J38=0),I38>0,I38<20),AND(OR(J38=1, J38=0),I38>19,I38<51),AND(J38>1,J38<6,I38>0,I38<20)),\"Simples\",IF(OR(AND(OR(J38=1, J38=0),I38>50),AND(J38>1,J38<6,I38>19,I38<51),AND(J38>5,I38>0,I38<20)),\"Médio\",IF(OR(AND(J38>1,J38<6,I38>50),AND(J38>5,I38>19,I38<51),AND(J38>5,I38>50)),\"Complexo\",\"\"))),\"\"))","v":""},{"$f":"IF(L38=\"\",M38,IF(M38=\"\",L38,\"\"))","v":""},{"$f":"IF(AND(OR(K38=\"EE\",K38=\"CE\"),N38=\"Simples\"),3,\nIF(AND(OR(K38=\"EE\",K38=\"CE\"),N38=\"Médio\"),4,\nIF(AND(OR(K38=\"EE\",K38=\"CE\"),N38=\"Complexo\"),6,\nIF(AND(K38=\"SE\",N38=\"Simples\"),4,\nIF(AND(K38=\"SE\",N38=\"Médio\"),5,\nIF(AND(K38=\"SE\",N38=\"Complexo\"),7,0))))))","v":0},{"$f":"IF(AND(K38=\"ALI\",M38=\"Simples\"),7,\nIF(AND(K38=\"ALI\",M38=\"Médio\"),10,\nIF(AND(K38=\"ALI\",M38=\"Complexo\"),15,\nIF(AND(K38=\"AIE\",M38=\"Simples\"),5,\nIF(AND(K38=\"AIE\",M38=\"Médio\"),7,\nIF(AND(K38=\"AIE\",M38=\"Complexo\"),10,0))))))","v":0},0]
[null,null,{"$f":"IF(B39<>\"\",VLOOKUP(B39,'Tipo Projeto'!$A$3:$B$36,2,0),0)","v":0},null,null,null,null,null,null,null,null,{"$f":"IF(K39=\"EE\",IF(OR(AND(OR(J39=1,J39=0),I39>0,I39<5),AND(OR(J39=1,J39=0),I39>4,I39<16),AND(J39=2,I39>0,I39<5)),\"Simples\",IF(OR(AND(OR(J39=1,J39=0),I39>15),AND(J39=2,I39>4,I39<16),AND(J39>2,I39>0,I39<5)),\"Médio\",IF(OR(AND(J39=2,I39>15),AND(J39>2,I39>4,I39<16),AND(J39>2,I39>15)),\"Complexo\",\"\"))),\nIF(OR(K39=\"CE\",K39=\"SE\"),IF(OR(AND(OR(J39=1,J39=0),I39>0,I39<6),AND(OR(J39=1,J39=0),I39>5,I39<20),AND(J39>1,J39<4,I39>0,I39<6)),\"Simples\",IF(OR(AND(OR(J39=1,J39=0),I39>19),AND(J39>1,J39<4,I39>5,I39<20),AND(J39>3,I39>0,I39<6)),\"Médio\",IF(OR(AND(J39>1,J39<4,I39>19),AND(J39>3,I39>5,I39<20),AND(J39>3,I39>19)),\"Complexo\",\"\"))),\"\"))","v":""},{"$f":"IF(K39=\"ALI\",IF(OR(AND(OR(J39=1,J39=0),I39>0,I39<20),AND(OR(J39=1,J39=0),I39>19,I39<51),AND(J39>1,J39<6,I39>0,I39<20)),\"Simples\",IF(OR(AND(OR(J39=1,J39=0),I39>50),AND(J39>1,J39<6,I39>19,I39<51),AND(J39>5,I39>0,I39<20)),\"Médio\",IF(OR(AND(J39>1,J39<6,I39>50),AND(J39>5,I39>19,I39<51),AND(J39>5,I39>50)),\"Complexo\",\"\"))),\nIF(K39=\"AIE\",IF(OR(AND(OR(J39=1, J39=0),I39>0,I39<20),AND(OR(J39=1, J39=0),I39>19,I39<51),AND(J39>1,J39<6,I39>0,I39<20)),\"Simples\",IF(OR(AND(OR(J39=1, J39=0),I39>50),AND(J39>1,J39<6,I39>19,I39<51),AND(J39>5,I39>0,I39<20)),\"Médio\",IF(OR(AND(J39>1,J39<6,I39>50),AND(J39>5,I39>19,I39<51),AND(J39>5,I39>50)),\"Complexo\",\"\"))),\"\"))","v":""},{"$f":"IF(L39=\"\",M39,IF(M39=\"\",L39,\"\"))","v":""},{"$f":"IF(AND(OR(K39=\"EE\",K39=\"CE\"),N39=\"Simples\"),3,\nIF(AND(OR(K39=\"EE\",K39=\"CE\"),N39=\"Médio\"),4,\nIF(AND(OR(K39=\"EE\",K39=\"CE\"),N39=\"Complexo\"),6,\nIF(AND(K39=\"SE\",N39=\"Simples\"),4,\nIF(AND(K39=\"SE\",N39=\"Médio\"),5,\nIF(AND(K39=\"SE\",N39=\"Complexo\"),7,0))))))","v":0},{"$f":"IF(AND(K39=\"ALI\",M39=\"Simples\"),7,\nIF(AND(K39=\"ALI\",M39=\"Médio\"),10,\nIF(AND(K39=\"ALI\",M39=\"Complexo\"),15,\nIF(AND(K39=\"AIE\",M39=\"Simples\"),5,\nIF(AND(K39=\"AIE\",M39=\"Médio\"),7,\nIF(AND(K39=\"AIE\",M39=\"Complexo\"),10,0))))))","v":0},0]
[null,null,{"$f":"IF(B40<>\"\",VLOOKUP(B40,'Tipo Projeto'!$A$3:$B$36,2,0),0)","v":0},null,null,null,null,null,null,null,null,"","","",0,0,0]
[null,null,{"$f":"IF(B41<>\"\",VLOOKUP(B41,'Tipo Projeto'!$A$3:$B$36,2,0),0)","v":0},null,null,null,null,null,null,null,null,"","","",0,0,0]
[null,null,{"$f":"IF(B42<>\"\",VLOOKUP(B42,'Tipo Projeto'!$A$3:$B$36,2,0),0)","v":0},null,null,null,null,null,null,null,null,"","","",0,0,0]
[null,null,{"$f":"IF(B43<>\"\",VLOOKUP(B43,'Tipo Projeto'!$A$3:$B$36,2,0),0)","v":0},null,null,null,null,null,null,null,null,"","","",0,0,0]
[null,null,{"$f":"IF(B44<>\"\",VLOOKUP(B44,'Tipo Projeto'!$A$3:$B$36,2,0),0)","v":0},null,null,null,null,null,null,null,null,"","","",0,0,0]
[null,null,{"$f":"IF(B45<>\"\",VLOOKUP(B45,'Tipo Projeto'!$A$3:$B$36,2,0),0)","v":0},null,null,null,null,null,null,null,null,{"$f":"IF(K45=\"EE\",IF(OR(AND(OR(J45=1,J45=0),I45>0,I45<5),AND(OR(J45=1,J45=0),I45>4,I45<16),AND(J45=2,I45>0,I45<5)),\"Simples\",IF(OR(AND(OR(J45=1,J45=0),I45>15),AND(J45=2,I45>4,I45<16),AND(J45>2,I45>0,I45<5)),\"Médio\",IF(OR(AND(J45=2,I45>15),AND(J45>2,I45>4,I45<16),AND(J45>2,I45>15)),\"Complexo\",\"\"))),\nIF(OR(K45=\"CE\",K45=\"SE\"),IF(OR(AND(OR(J45=1,J45=0),I45>0,I45<6),AND(OR(J45=1,J45=0),I45>5,I45<20),AND(J45>1,J45<4,I45>0,I45<6)),\"Simples\",IF(OR(AND(OR(J45=1,J45=0),I45>19),AND(J45>1,J45<4,I45>5,I45<20),AND(J45>3,I45>0,I45<6)),\"Médio\",IF(OR(AND(J45>1,J45<4,I45>19),AND(J45>3,I45>5,I45<20),AND(J45>3,I45>19)),\"Complexo\",\"\"))),\"\"))","v":""},{"$f":"IF(K45=\"ALI\",IF(OR(AND(OR(J45=1,J45=0),I45>0,I45<20),AND(OR(J45=1,J45=0),I45>19,I45<51),AND(J45>1,J45<6,I45>0,I45<20)),\"Simples\",IF(OR(AND(OR(J45=1,J45=0),I45>50),AND(J45>1,J45<6,I45>19,I45<51),AND(J45>5,I45>0,I45<20)),\"Médio\",IF(OR(AND(J45>1,J45<6,I45>50),AND(J45>5,I45>19,I45<51),AND(J45>5,I45>50)),\"Complexo\",\"\"))),\nIF(K45=\"AIE\",IF(OR(AND(OR(J45=1, J45=0),I45>0,I45<20),AND(OR(J45=1, J45=0),I45>19,I45<51),AND(J45>1,J45<6,I45>0,I45<20)),\"Simples\",IF(OR(AND(OR(J45=1, J45=0),I45>50),AND(J45>1,J45<6,I45>19,I45<51),AND(J45>5,I45>0,I45<20)),\"Médio\",IF(OR(AND(J45>1,J45<6,I45>50),AND(J45>5,I45>19,I45<51),AND(J45>5,I45>50)),\"Complexo\",\"\"))),\"\"))","v":""},{"$f":"IF(L45=\"\",M45,IF(M45=\"\",L45,\"\"))","v":""},{"$f":"IF(AND(OR(K45=\"EE\",K45=\"CE\"),N45=\"Simples\"),3,\nIF(AND(OR(K45=\"EE\",K45=\"CE\"),N45=\"Médio\"),4,\nIF(AND(OR(K45=\"EE\",K45=\"CE\"),N45=\"Complexo\"),6,\nIF(AND(K45=\"SE\",N45=\"Simples\"),4,\nIF(AND(K45=\"SE\",N45=\"Médio\"),5,\nIF(AND(K45=\"SE\",N45=\"Complexo\"),7,0))))))","v":0},{"$f":"IF(AND(K45=\"ALI\",M45=\"Simples\"),7,\nIF(AND(K45=\"ALI\",M45=\"Médio\"),10,\nIF(AND(K45=\"ALI\",M45=\"Complexo\"),15,\nIF(AND(K45=\"AIE\",M45=\"Simples\"),5,\nIF(AND(K45=\"AIE\",M45=\"Médio\"),7,\nIF(AND(K45=\"AIE\",M45=\"Complexo\"),10,0))))))","v":0},0]
[null,null,{"$f":"IF(B46<>\"\",VLOOKUP(B46,'Tipo Projeto'!$A$3:$B$36,2,0),0)","v":0},null,null,null,null,null,null,null,null,"","","",0,0,0]
[null,null,{"$f":"IF(B47<>\"\",VLOOKUP(B47,'Tipo Projeto'!$A$3:$B$36,2,0),0)","v":0},null,null,null,null,null,null,null,null,"","","",0,0,0]
[null,null,{"$f":"IF(B48<>\"\",VLOOKUP(B48,'Tipo Projeto'!$A$3:$B$36,2,0),0)","v":0},null,null,null,null,null,null,null,null,"","","",0,0,0]
[null,null,{"$f":"IF(B49<>\"\",VLOOKUP(B49,'Tipo Projeto'!$A$3:$B$36,2,0),0)","v":0},null,null,null,null,null,null,null,null,"","","",0,0,0]
[null,null,{"$f":"IF(B50<>\"\",VLOOKUP(B50,'Tipo Projeto'!$A$3:$B$36,2,0),0)","v":0},null,null,null,null,null,null,null,null,"","","",0,0,0]
[null,null,{"$f":"IF(B51<>\"\",VLOOKUP(B51,'Tipo Projeto'!$A$3:$B$36,2,0),0)","v":0},null,null,null,null,null,null,null,null,"","","",0,0,0]
[null,null,{"$f":"IF(B52<>\"\",VLOOKUP(B52,'Tipo Projeto'!$A$3:$B$36,2,0),0)","v":0},null,null,null,null,null,null,null,null,"","","",0,0,0]
[null,null,{"$f":"IF(B53<>\"\",VLOOKUP(B53,'Tipo Projeto'!$A$3:$B$36,2,0),0)","v":0},null,null,null,null,null,null,null,null,{"$f":"IF(K53=\"EE\",IF(OR(AND(OR(J53=1,J53=0),I53>0,I53<5),AND(OR(J53=1,J53=0),I53>4,I53<16),AND(J53=2,I53>0,I53<5)),\"Simples\",IF(OR(AND(OR(J53=1,J53=0),I53>15),AND(J53=2,I53>4,I53<16),AND(J53>2,I53>0,I53<5)),\"Médio\",IF(OR(AND(J53=2,I53>15),AND(J53>2,I53>4,I53<16),AND(J53>2,I53>15)),\"Complexo\",\"\"))),\nIF(OR(K53=\"CE\",K53=\"SE\"),IF(OR(AND(OR(J53=1,J53=0),I53>0,I53<6),AND(OR(J53=1,J53=0),I53>5,I53<20),AND(J53>1,J53<4,I53>0,I53<6)),\"Simples\",IF(OR(AND(OR(J53=1,J53=0),I53>19),AND(J53>1,J53<4,I53>5,I53<20),AND(J53>3,I53>0,I53<6)),\"Médio\",IF(OR(AND(J53>1,J53<4,I53>19),AND(J53>3,I53>5,I53<20),AND(J53>3,I53>19)),\"Complexo\",\"\"))),\"\"))","v":""},{"$f":"IF(K53=\"ALI\",IF(OR(AND(OR(J53=1,J53=0),I53>0,I53<20),AND(OR(J53=1,J53=0),I53>19,I53<51),AND(J53>1,J53<6,I53>0,I53<20)),\"Simples\",IF(OR(AND(OR(J53=1,J53=0),I53>50),AND(J53>1,J53<6,I53>19,I53<51),AND(J53>5,I53>0,I53<20)),\"Médio\",IF(OR(AND(J53>1,J53<6,I53>50),AND(J53>5,I53>19,I53<51),AND(J53>5,I53>50)),\"Complexo\",\"\"))),\nIF(K53=\"AIE\",IF(OR(AND(OR(J53=1, J53=0),I53>0,I53<20),AND(OR(J53=1, J53=0),I53>19,I53<51),AND(J53>1,J53<6,I53>0,I53<20)),\"Simples\",IF(OR(AND(OR(J53=1, J53=0),I53>50),AND(J53>1,J53<6,I53>19,I53<51),AND(J53>5,I53>0,I53<20)),\"Médio\",IF(OR(AND(J53>1,J53<6,I53>50),AND(J53>5,I53>19,I53<51),AND(J53>5,I53>50)),\"Complexo\",\"\"))),\"\"))","v":""},{"$f":"IF(L53=\"\",M53,IF(M53=\"\",L53,\"\"))","v":""},{"$f":"IF(AND(OR(K53=\"EE\",K53=\"CE\"),N53=\"Simples\"),3,\nIF(AND(OR(K53=\"EE\",K53=\"CE\"),N53=\"Médio\"),4,\nIF(AND(OR(K53=\"EE\",K53=\"CE\"),N53=\"Complexo\"),6,\nIF(AND(K53=\"SE\",N53=\"Simples\"),4,\nIF(AND(K53=\"SE\",N53=\"Médio\"),5,\nIF(AND(K53=\"SE\",N53=\"Complexo\"),7,0))))))","v":0},{"$f":"IF(AND(K53=\"ALI\",M53=\"Simples\"),7,\nIF(AND(K53=\"ALI\",M53=\"Médio\"),10,\nIF(AND(K53=\"ALI\",M53=\"Complexo\"),15,\nIF(AND(K53=\"AIE\",M53=\"Simples\"),5,\nIF(AND(K53=\"AIE\",M53=\"Médio\"),7,\nIF(AND(K53=\"AIE\",M53=\"Complexo\"),10,0))))))","v":0},0]
[null,null,{"$f":"IF(B54<>\"\",VLOOKUP(B54,'Tipo Projeto'!$A$3:$B$36,2,0),0)","v":0},null,null,null,null,null,null,null,null,{"$f":"IF(K54=\"EE\",IF(OR(AND(OR(J54=1,J54=0),I54>0,I54<5),AND(OR(J54=1,J54=0),I54>4,I54<16),AND(J54=2,I54>0,I54<5)),\"Simples\",IF(OR(AND(OR(J54=1,J54=0),I54>15),AND(J54=2,I54>4,I54<16),AND(J54>2,I54>0,I54<5)),\"Médio\",IF(OR(AND(J54=2,I54>15),AND(J54>2,I54>4,I54<16),AND(J54>2,I54>15)),\"Complexo\",\"\"))),\nIF(OR(K54=\"CE\",K54=\"SE\"),IF(OR(AND(OR(J54=1,J54=0),I54>0,I54<6),AND(OR(J54=1,J54=0),I54>5,I54<20),AND(J54>1,J54<4,I54>0,I54<6)),\"Simples\",IF(OR(AND(OR(J54=1,J54=0),I54>19),AND(J54>1,J54<4,I54>5,I54<20),AND(J54>3,I54>0,I54<6)),\"Médio\",IF(OR(AND(J54>1,J54<4,I54>19),AND(J54>3,I54>5,I54<20),AND(J54>3,I54>19)),\"Complexo\",\"\"))),\"\"))","v":""},{"$f":"IF(K54=\"ALI\",IF(OR(AND(OR(J54=1,J54=0),I54>0,I54<20),AND(OR(J54=1,J54=0),I54>19,I54<51),AND(J54>1,J54<6,I54>0,I54<20)),\"Simples\",IF(OR(AND(OR(J54=1,J54=0),I54>50),AND(J54>1,J54<6,I54>19,I54<51),AND(J54>5,I54>0,I54<20)),\"Médio\",IF(OR(AND(J54>1,J54<6,I54>50),AND(J54>5,I54>19,I54<51),AND(J54>5,I54>50)),\"Complexo\",\"\"))),\nIF(K54=\"AIE\",IF(OR(AND(OR(J54=1, J54=0),I54>0,I54<20),AND(OR(J54=1, J54=0),I54>19,I54<51),AND(J54>1,J54<6,I54>0,I54<20)),\"Simples\",IF(OR(AND(OR(J54=1, J54=0),I54>50),AND(J54>1,J54<6,I54>19,I54<51),AND(J54>5,I54>0,I54<20)),\"Médio\",IF(OR(AND(J54>1,J54<6,I54>50),AND(J54>5,I54>19,I54<51),AND(J54>5,I54>50)),\"Complexo\",\"\"))),\"\"))","v":""},{"$f":"IF(L54=\"\",M54,IF(M54=\"\",L54,\"\"))","v":""},{"$f":"IF(AND(OR(K54=\"EE\",K54=\"CE\"),N54=\"Simples\"),3,\nIF(AND(OR(K54=\"EE\",K54=\"CE\"),N54=\"Médio\"),4,\nIF(AND(OR(K54=\"EE\",K54=\"CE\"),N54=\"Complexo\"),6,\nIF(AND(K54=\"SE\",N54=\"Simples\"),4,\nIF(AND(K54=\"SE\",N54=\"Médio\"),5,\nIF(AND(K54=\"SE\",N54=\"Complexo\"),7,0))))))","v":0},{"$f":"IF(AND(K54=\"ALI\",M54=\"Simples\"),7,\nIF(AND(K54=\"ALI\",M54=\"Médio\"),10,\nIF(AND(K54=\"ALI\",M54=\"Complexo\"),15,\nIF(AND(K54=\"AIE\",M54=\"Simples\"),5,\nIF(AND(K54=\"AIE\",M54=\"Médio\"),7,\nIF(AND(K54=\"AIE\",M54=\"Complexo\"),10,0))))))","v":0},0]
[null,null,{"$f":"IF(B55<>\"\",VLOOKUP(B55,'Tipo Projeto'!$A$3:$B$36,2,0),0)","v":0},null,null,null,null,null,null,null,null,"","","",0,0,0]
[null,null,{"$f":"IF(B56<>\"\",VLOOKUP(B56,'Tipo Projeto'!$A$3:$B$36,2,0),0)","v":0},null,null,null,null,null,null,null,null,"","","",0,0,0]
[null,null,{"$f":"IF(B57<>\"\",VLOOKUP(B57,'Tipo Projeto'!$A$3:$B$36,2,0),0)","v":0},null,null,null,null,null,null,null,null,"","","",0,0,0]
[null,null,{"$f":"IF(B58<>\"\",VLOOKUP(B58,'Tipo Projeto'!$A$3:$B$36,2,0),0)","v":0},null,null,null,null,null,null,null,null,"","","",0,0,0]
[null,null,{"$f":"IF(B59<>\"\",VLOOKUP(B59,'Tipo Projeto'!$A$3:$B$36,2,0),0)","v":0},null,null,null,null,null,null,null,null,"","","",0,0,0]
[null,null,{"$f":"IF(B60<>\"\",VLOOKUP(B60,'Tipo Projeto'!$A$3:$B$36,2,0),0)","v":0},null,null,null,null,null,null,null,null,{"$f":"IF(K60=\"EE\",IF(OR(AND(OR(J60=1,J60=0),I60>0,I60<5),AND(OR(J60=1,J60=0),I60>4,I60<16),AND(J60=2,I60>0,I60<5)),\"Simples\",IF(OR(AND(OR(J60=1,J60=0),I60>15),AND(J60=2,I60>4,I60<16),AND(J60>2,I60>0,I60<5)),\"Médio\",IF(OR(AND(J60=2,I60>15),AND(J60>2,I60>4,I60<16),AND(J60>2,I60>15)),\"Complexo\",\"\"))),\nIF(OR(K60=\"CE\",K60=\"SE\"),IF(OR(AND(OR(J60=1,J60=0),I60>0,I60<6),AND(OR(J60=1,J60=0),I60>5,I60<20),AND(J60>1,J60<4,I60>0,I60<6)),\"Simples\",IF(OR(AND(OR(J60=1,J60=0),I60>19),AND(J60>1,J60<4,I60>5,I60<20),AND(J60>3,I60>0,I60<6)),\"Médio\",IF(OR(AND(J60>1,J60<4,I60>19),AND(J60>3,I60>5,I60<20),AND(J60>3,I60>19)),\"Complexo\",\"\"))),\"\"))","v":""},{"$f":"IF(K60=\"ALI\",IF(OR(AND(OR(J60=1,J60=0),I60>0,I60<20),AND(OR(J60=1,J60=0),I60>19,I60<51),AND(J60>1,J60<6,I60>0,I60<20)),\"Simples\",IF(OR(AND(OR(J60=1,J60=0),I60>50),AND(J60>1,J60<6,I60>19,I60<51),AND(J60>5,I60>0,I60<20)),\"Médio\",IF(OR(AND(J60>1,J60<6,I60>50),AND(J60>5,I60>19,I60<51),AND(J60>5,I60>50)),\"Complexo\",\"\"))),\nIF(K60=\"AIE\",IF(OR(AND(OR(J60=1, J60=0),I60>0,I60<20),AND(OR(J60=1, J60=0),I60>19,I60<51),AND(J60>1,J60<6,I60>0,I60<20)),\"Simples\",IF(OR(AND(OR(J60=1, J60=0),I60>50),AND(J60>1,J60<6,I60>19,I60<51),AND(J60>5,I60>0,I60<20)),\"Médio\",IF(OR(AND(J60>1,J60<6,I60>50),AND(J60>5,I60>19,I60<51),AND(J60>5,I60>50)),\"Complexo\",\"\"))),\"\"))","v":""},{"$f":"IF(L60=\"\",M60,IF(M60=\"\",L60,\"\"))","v":""},{"$f":"IF(AND(OR(K60=\"EE\",K60=\"CE\"),N60=\"Simples\"),3,\nIF(AND(OR(K60=\"EE\",K60=\"CE\"),N60=\"Médio\"),4,\nIF(AND(OR(K60=\"EE\",K60=\"CE\"),N60=\"Complexo\"),6,\nIF(AND(K60=\"SE\",N60=\"Simples\"),4,\nIF(AND(K60=\"SE\",N60=\"Médio\"),5,\nIF(AND(K60=\"SE\",N60=\"Complexo\"),7,0))))))","v":0},{"$f":"IF(AND(K60=\"ALI\",M60=\"Simples\"),7,\nIF(AND(K60=\"ALI\",M60=\"Médio\"),10,\nIF(AND(K60=\"ALI\",M60=\"Complexo\"),15,\nIF(AND(K60=\"AIE\",M60=\"Simples\"),5,\nIF(AND(K60=\"AIE\",M60=\"Médio\"),7,\nIF(AND(K60=\"AIE\",M60=\"Complexo\"),10,0))))))","v":0},0]
[null,null,{"$f":"IF(B61<>\"\",VLOOKUP(B61,'Tipo Projeto'!$A$3:$B$36,2,0),0)","v":0},null,null,null,null,null,null,null,null,"","","",0,0,0]
[null,null,{"$f":"IF(B62<>\"\",VLOOKUP(B62,'Tipo Projeto'!$A$3:$B$36,2,0),0)","v":0},null,null,null,null,null,null,null,null,"","","",0,0,0]
[null,null,{"$f":"IF(B63<>\"\",VLOOKUP(B63,'Tipo Projeto'!$A$3:$B$36,2,0),0)","v":0},null,null,null,null,null,null,null,null,"","","",0,0,0]
[null,null,{"$f":"IF(B64<>\"\",VLOOKUP(B64,'Tipo Projeto'!$A$3:$B$36,2,0),0)","v":0},null,null,null,null,null,null,null,null,"","","",0,0,0]
[null,null,{"$f":"IF(B65<>\"\",VLOOKUP(B65,'Tipo Projeto'!$A$3:$B$36,2,0),0)","v":0},null,null,null,null,null,null,null,null,"","","",0,0,0]
[null,null,{"$f":"IF(B66<>\"\",VLOOKUP(B66,'Tipo Projeto'!$A$3:$B$36,2,0),0)","v":0},null,null,null,null,null,null,null,null,"","","",0,0,0]
[null,null,{"$f":"IF(B67<>\"\",VLOOKUP(B67,'Tipo Projeto'!$A$3:$B$36,2,0),0)","v":0},null,null,null,null,null,null,null,null,{"$f":"IF(K67=\"EE\",IF(OR(AND(OR(J67=1,J67=0),I67>0,I67<5),AND(OR(J67=1,J67=0),I67>4,I67<16),AND(J67=2,I67>0,I67<5)),\"Simples\",IF(OR(AND(OR(J67=1,J67=0),I67>15),AND(J67=2,I67>4,I67<16),AND(J67>2,I67>0,I67<5)),\"Médio\",IF(OR(AND(J67=2,I67>15),AND(J67>2,I67>4,I67<16),AND(J67>2,I67>15)),\"Complexo\",\"\"))),\nIF(OR(K67=\"CE\",K67=\"SE\"),IF(OR(AND(OR(J67=1,J67=0),I67>0,I67<6),AND(OR(J67=1,J67=0),I67>5,I67<20),AND(J67>1,J67<4,I67>0,I67<6)),\"Simples\",IF(OR(AND(OR(J67=1,J67=0),I67>19),AND(J67>1,J67<4,I67>5,I67<20),AND(J67>3,I67>0,I67<6)),\"Médio\",IF(OR(AND(J67>1,J67<4,I67>19),AND(J67>3,I67>5,I67<20),AND(J67>3,I67>19)),\"Complexo\",\"\"))),\"\"))","v":""},{"$f":"IF(K67=\"ALI\",IF(OR(AND(OR(J67=1,J67=0),I67>0,I67<20),AND(OR(J67=1,J67=0),I67>19,I67<51),AND(J67>1,J67<6,I67>0,I67<20)),\"Simples\",IF(OR(AND(OR(J67=1,J67=0),I67>50),AND(J67>1,J67<6,I67>19,I67<51),AND(J67>5,I67>0,I67<20)),\"Médio\",IF(OR(AND(J67>1,J67<6,I67>50),AND(J67>5,I67>19,I67<51),AND(J67>5,I67>50)),\"Complexo\",\"\"))),\nIF(K67=\"AIE\",IF(OR(AND(OR(J67=1, J67=0),I67>0,I67<20),AND(OR(J67=1, J67=0),I67>19,I67<51),AND(J67>1,J67<6,I67>0,I67<20)),\"Simples\",IF(OR(AND(OR(J67=1, J67=0),I67>50),AND(J67>1,J67<6,I67>19,I67<51),AND(J67>5,I67>0,I67<20)),\"Médio\",IF(OR(AND(J67>1,J67<6,I67>50),AND(J67>5,I67>19,I67<51),AND(J67>5,I67>50)),\"Complexo\",\"\"))),\"\"))","v":""},{"$f":"IF(L67=\"\",M67,IF(M67=\"\",L67,\"\"))","v":""},{"$f":"IF(AND(OR(K67=\"EE\",K67=\"CE\"),N67=\"Simples\"),3,\nIF(AND(OR(K67=\"EE\",K67=\"CE\"),N67=\"Médio\"),4,\nIF(AND(OR(K67=\"EE\",K67=\"CE\"),N67=\"Complexo\"),6,\nIF(AND(K67=\"SE\",N67=\"Simples\"),4,\nIF(AND(K67=\"SE\",N67=\"Médio\"),5,\nIF(AND(K67=\"SE\",N67=\"Complexo\"),7,0))))))","v":0},{"$f":"IF(AND(K67=\"ALI\",M67=\"Simples\"),7,\nIF(AND(K67=\"ALI\",M67=\"Médio\"),10,\nIF(AND(K67=\"ALI\",M67=\"Complexo\"),15,\nIF(AND(K67=\"AIE\",M67=\"Simples\"),5,\nIF(AND(K67=\"AIE\",M67=\"Médio\"),7,\nIF(AND(K67=\"AIE\",M67=\"Complexo\"),10,0))))))","v":0},0]
[null,null,{"$f":"IF(B68<>\"\",VLOOKUP(B68,'Tipo Projeto'!$A$3:$B$36,2,0),0)","v":0},null,null,null,null,null,null,null,null,"","","",0,0,0]
[null,null,{"$f":"IF(B69<>\"\",VLOOKUP(B69,'Tipo Projeto'!$A$3:$B$36,2,0),0)","v":0},null,null,null,null,null,null,null,null,"","","",0,0,0]
[null,null,{"$f":"IF(B70<>\"\",VLOOKUP(B70,'Tipo Projeto'!$A$3:$B$36,2,0),0)","v":0},null,null,null,null,null,null,null,null,"","","",0,0,0]
[null,null,{"$f":"IF(B71<>\"\",VLOOKUP(B71,'Tipo Projeto'!$A$3:$B$36,2,0),0)","v":0},null,null,null,null,null,null,null,null,"","","",0,0,0]
[null,null,{"$f":"IF(B72<>\"\",VLOOKUP(B72,'Tipo Projeto'!$A$3:$B$36,2,0),0)","v":0},null,null,null,null,null,null,null,null,"","","",0,0,0]
[null,null,{"$f":"IF(B73<>\"\",VLOOKUP(B73,'Tipo Projeto'!$A$3:$B$36,2,0),0)","v":0},null,null,null,null,null,null,null,null,"","","",0,0,0]
[null,null,{"$f":"IF(B74<>\"\",VLOOKUP(B74,'Tipo Projeto'!$A$3:$B$36,2,0),0)","v":0},null,null,null,null,null,null,null,null,"","","",0,0,0]
[null,null,{"$f":"IF(B75<>\"\",VLOOKUP(B75,'Tipo Projeto'!$A$3:$B$36,2,0),0)","v":0},null,null,null,null,null,null,null,null,"","","",0,0,{"$f":"IF(B75<>\"Manutenção em interface\",IF(B75<>\"Desenv., Manutenção e Publicação de Páginas Estáticas\",(O75+P75)*C75,C75),C75)","v":0}]
[null,null,{"$f":"IF(B76<>\"\",VLOOKUP(B76,'Tipo Projeto'!$A$3:$B$36,2,0),0)","v":0},null,null,null,null,null,null,null,null,"","","",0,0,0]
[null,null,{"$f":"IF(B77<>\"\",VLOOKUP(B77,'Tipo Projeto'!$A$3:$B$36,2,0),0)","v":0},null,null,null,null,null,null,null,null,"","","",0,0,0]
[null,null,{"$f":"IF(B78<>\"\",VLOOKUP(B78,'Tipo Projeto'!$A$3:$B$36,2,0),0)","v":0},null,null,null,null,null,null,null,null,"","","",0,0,0]
[null,null,{"$f":"IF(B79<>\"\",VLOOKUP(B79,'Tipo Projeto'!$A$3:$B$36,2,0),0)","v":0},null,null,null,null,null,null,null,null,"","","",0,0,0]
[null,null,{"$f":"IF(B80<>\"\",VLOOKUP(B80,'Tipo Projeto'!$A$3:$B$36,2,0),0)","v":0},null,null,null,null,null,null,null,null,{"$f":"IF(K80=\"EE\",IF(OR(AND(OR(J80=1,J80=0),I80>0,I80<5),AND(OR(J80=1,J80=0),I80>4,I80<16),AND(J80=2,I80>0,I80<5)),\"Simples\",IF(OR(AND(OR(J80=1,J80=0),I80>15),AND(J80=2,I80>4,I80<16),AND(J80>2,I80>0,I80<5)),\"Médio\",IF(OR(AND(J80=2,I80>15),AND(J80>2,I80>4,I80<16),AND(J80>2,I80>15)),\"Complexo\",\"\"))),\nIF(OR(K80=\"CE\",K80=\"SE\"),IF(OR(AND(OR(J80=1,J80=0),I80>0,I80<6),AND(OR(J80=1,J80=0),I80>5,I80<20),AND(J80>1,J80<4,I80>0,I80<6)),\"Simples\",IF(OR(AND(OR(J80=1,J80=0),I80>19),AND(J80>1,J80<4,I80>5,I80<20),AND(J80>3,I80>0,I80<6)),\"Médio\",IF(OR(AND(J80>1,J80<4,I80>19),AND(J80>3,I80>5,I80<20),AND(J80>3,I80>19)),\"Complexo\",\"\"))),\"\"))","v":""},{"$f":"IF(K80=\"ALI\",IF(OR(AND(OR(J80=1,J80=0),I80>0,I80<20),AND(OR(J80=1,J80=0),I80>19,I80<51),AND(J80>1,J80<6,I80>0,I80<20)),\"Simples\",IF(OR(AND(OR(J80=1,J80=0),I80>50),AND(J80>1,J80<6,I80>19,I80<51),AND(J80>5,I80>0,I80<20)),\"Médio\",IF(OR(AND(J80>1,J80<6,I80>50),AND(J80>5,I80>19,I80<51),AND(J80>5,I80>50)),\"Complexo\",\"\"))),\nIF(K80=\"AIE\",IF(OR(AND(OR(J80=1, J80=0),I80>0,I80<20),AND(OR(J80=1, J80=0),I80>19,I80<51),AND(J80>1,J80<6,I80>0,I80<20)),\"Simples\",IF(OR(AND(OR(J80=1, J80=0),I80>50),AND(J80>1,J80<6,I80>19,I80<51),AND(J80>5,I80>0,I80<20)),\"Médio\",IF(OR(AND(J80>1,J80<6,I80>50),AND(J80>5,I80>19,I80<51),AND(J80>5,I80>50)),\"Complexo\",\"\"))),\"\"))","v":""},{"$f":"IF(L80=\"\",M80,IF(M80=\"\",L80,\"\"))","v":""},{"$f":"IF(AND(OR(K80=\"EE\",K80=\"CE\"),N80=\"Simples\"),3,\nIF(AND(OR(K80=\"EE\",K80=\"CE\"),N80=\"Médio\"),4,\nIF(AND(OR(K80=\"EE\",K80=\"CE\"),N80=\"Complexo\"),6,\nIF(AND(K80=\"SE\",N80=\"Simples\"),4,\nIF(AND(K80=\"SE\",N80=\"Médio\"),5,\nIF(AND(K80=\"SE\",N80=\"Complexo\"),7,0))))))","v":0},{"$f":"IF(AND(K80=\"ALI\",M80=\"Simples\"),7,\nIF(AND(K80=\"ALI\",M80=\"Médio\"),10,\nIF(AND(K80=\"ALI\",M80=\"Complexo\"),15,\nIF(AND(K80=\"AIE\",M80=\"Simples\"),5,\nIF(AND(K80=\"AIE\",M80=\"Médio\"),7,\nIF(AND(K80=\"AIE\",M80=\"Complexo\"),10,0))))))","v":0},0]
[null,null,{"$f":"IF(B81<>\"\",VLOOKUP(B81,'Tipo Projeto'!$A$3:$B$36,2,0),0)","v":0},null,null,null,null,null,null,null,null,{"$f":"IF(K81=\"EE\",IF(OR(AND(OR(J81=1,J81=0),I81>0,I81<5),AND(OR(J81=1,J81=0),I81>4,I81<16),AND(J81=2,I81>0,I81<5)),\"Simples\",IF(OR(AND(OR(J81=1,J81=0),I81>15),AND(J81=2,I81>4,I81<16),AND(J81>2,I81>0,I81<5)),\"Médio\",IF(OR(AND(J81=2,I81>15),AND(J81>2,I81>4,I81<16),AND(J81>2,I81>15)),\"Complexo\",\"\"))),\nIF(OR(K81=\"CE\",K81=\"SE\"),IF(OR(AND(OR(J81=1,J81=0),I81>0,I81<6),AND(OR(J81=1,J81=0),I81>5,I81<20),AND(J81>1,J81<4,I81>0,I81<6)),\"Simples\",IF(OR(AND(OR(J81=1,J81=0),I81>19),AND(J81>1,J81<4,I81>5,I81<20),AND(J81>3,I81>0,I81<6)),\"Médio\",IF(OR(AND(J81>1,J81<4,I81>19),AND(J81>3,I81>5,I81<20),AND(J81>3,I81>19)),\"Complexo\",\"\"))),\"\"))","v":""},{"$f":"IF(K81=\"ALI\",IF(OR(AND(OR(J81=1,J81=0),I81>0,I81<20),AND(OR(J81=1,J81=0),I81>19,I81<51),AND(J81>1,J81<6,I81>0,I81<20)),\"Simples\",IF(OR(AND(OR(J81=1,J81=0),I81>50),AND(J81>1,J81<6,I81>19,I81<51),AND(J81>5,I81>0,I81<20)),\"Médio\",IF(OR(AND(J81>1,J81<6,I81>50),AND(J81>5,I81>19,I81<51),AND(J81>5,I81>50)),\"Complexo\",\"\"))),\nIF(K81=\"AIE\",IF(OR(AND(OR(J81=1, J81=0),I81>0,I81<20),AND(OR(J81=1, J81=0),I81>19,I81<51),AND(J81>1,J81<6,I81>0,I81<20)),\"Simples\",IF(OR(AND(OR(J81=1, J81=0),I81>50),AND(J81>1,J81<6,I81>19,I81<51),AND(J81>5,I81>0,I81<20)),\"Médio\",IF(OR(AND(J81>1,J81<6,I81>50),AND(J81>5,I81>19,I81<51),AND(J81>5,I81>50)),\"Complexo\",\"\"))),\"\"))","v":""},{"$f":"IF(L81=\"\",M81,IF(M81=\"\",L81,\"\"))","v":""},{"$f":"IF(AND(OR(K81=\"EE\",K81=\"CE\"),N81=\"Simples\"),3,\nIF(AND(OR(K81=\"EE\",K81=\"CE\"),N81=\"Médio\"),4,\nIF(AND(OR(K81=\"EE\",K81=\"CE\"),N81=\"Complexo\"),6,\nIF(AND(K81=\"SE\",N81=\"Simples\"),4,\nIF(AND(K81=\"SE\",N81=\"Médio\"),5,\nIF(AND(K81=\"SE\",N81=\"Complexo\"),7,0))))))","v":0},{"$f":"IF(AND(K81=\"ALI\",M81=\"Simples\"),7,\nIF(AND(K81=\"ALI\",M81=\"Médio\"),10,\nIF(AND(K81=\"ALI\",M81=\"Complexo\"),15,\nIF(AND(K81=\"AIE\",M81=\"Simples\"),5,\nIF(AND(K81=\"AIE\",M81=\"Médio\"),7,\nIF(AND(K81=\"AIE\",M81=\"Complexo\"),10,0))))))","v":0},0]
[null,null,{"$f":"IF(B82<>\"\",VLOOKUP(B82,'Tipo Projeto'!$A$3:$B$36,2,0),0)","v":0},null,null,null,null,null,null,null,null,"","","",0,0,0]
[null,null,{"$f":"IF(B83<>\"\",VLOOKUP(B83,'Tipo Projeto'!$A$3:$B$36,2,0),0)","v":0},null,null,null,null,null,null,null,null,"","","",0,0,0]
[null,null,{"$f":"IF(B84<>\"\",VLOOKUP(B84,'Tipo Projeto'!$A$3:$B$36,2,0),0)","v":0},null,null,null,null,null,null,null,null,"","","",0,0,0]
[null,null,{"$f":"IF(B85<>\"\",VLOOKUP(B85,'Tipo Projeto'!$A$3:$B$36,2,0),0)","v":0},null,null,null,null,null,null,null,null,"","","",0,0,0]
[null,null,{"$f":"IF(B86<>\"\",VLOOKUP(B86,'Tipo Projeto'!$A$3:$B$36,2,0),0)","v":0},null,null,null,null,null,null,null,null,"","","",0,0,0]
[null,null,{"$f":"IF(B87<>\"\",VLOOKUP(B87,'Tipo Projeto'!$A$3:$B$36,2,0),0)","v":0},null,null,null,null,null,null,null,null,"","","",0,0,0]
[null,null,{"$f":"IF(B88<>\"\",VLOOKUP(B88,'Tipo Projeto'!$A$3:$B$36,2,0),0)","v":0},null,null,null,null,null,null,null,null,"","","",0,0,0]
[null,null,{"$f":"IF(B89<>\"\",VLOOKUP(B89,'Tipo Projeto'!$A$3:$B$36,2,0),0)","v":0},null,null,null,null,null,null,null,null,"","","",0,0,0]
[null,null,{"$f":"IF(B90<>\"\",VLOOKUP(B90,'Tipo Projeto'!$A$3:$B$36,2,0),0)","v":0},null,null,null,null,null,null,null,null,"","","",0,0,0]
[null,null,{"$f":"IF(B91<>\"\",VLOOKUP(B91,'Tipo Projeto'!$A$3:$B$36,2,0),0)","v":0},null,null,null,null,null,null,null,null,"","","",0,0,0]
[null,null,{"$f":"IF(B92<>\"\",VLOOKUP(B92,'Tipo Projeto'!$A$3:$B$36,2,0),0)","v":0},null,null,null,null,null,null,null,null,{"$f":"IF(K92=\"EE\",IF(OR(AND(OR(J92=1,J92=0),I92>0,I92<5),AND(OR(J92=1,J92=0),I92>4,I92<16),AND(J92=2,I92>0,I92<5)),\"Simples\",IF(OR(AND(OR(J92=1,J92=0),I92>15),AND(J92=2,I92>4,I92<16),AND(J92>2,I92>0,I92<5)),\"Médio\",IF(OR(AND(J92=2,I92>15),AND(J92>2,I92>4,I92<16),AND(J92>2,I92>15)),\"Complexo\",\"\"))),\nIF(OR(K92=\"CE\",K92=\"SE\"),IF(OR(AND(OR(J92=1,J92=0),I92>0,I92<6),AND(OR(J92=1,J92=0),I92>5,I92<20),AND(J92>1,J92<4,I92>0,I92<6)),\"Simples\",IF(OR(AND(OR(J92=1,J92=0),I92>19),AND(J92>1,J92<4,I92>5,I92<20),AND(J92>3,I92>0,I92<6)),\"Médio\",IF(OR(AND(J92>1,J92<4,I92>19),AND(J92>3,I92>5,I92<20),AND(J92>3,I92>19)),\"Complexo\",\"\"))),\"\"))","v":""},{"$f":"IF(K92=\"ALI\",IF(OR(AND(OR(J92=1,J92=0),I92>0,I92<20),AND(OR(J92=1,J92=0),I92>19,I92<51),AND(J92>1,J92<6,I92>0,I92<20)),\"Simples\",IF(OR(AND(OR(J92=1,J92=0),I92>50),AND(J92>1,J92<6,I92>19,I92<51),AND(J92>5,I92>0,I92<20)),\"Médio\",IF(OR(AND(J92>1,J92<6,I92>50),AND(J92>5,I92>19,I92<51),AND(J92>5,I92>50)),\"Complexo\",\"\"))),\nIF(K92=\"AIE\",IF(OR(AND(OR(J92=1, J92=0),I92>0,I92<20),AND(OR(J92=1, J92=0),I92>19,I92<51),AND(J92>1,J92<6,I92>0,I92<20)),\"Simples\",IF(OR(AND(OR(J92=1, J92=0),I92>50),AND(J92>1,J92<6,I92>19,I92<51),AND(J92>5,I92>0,I92<20)),\"Médio\",IF(OR(AND(J92>1,J92<6,I92>50),AND(J92>5,I92>19,I92<51),AND(J92>5,I92>50)),\"Complexo\",\"\"))),\"\"))","v":""},{"$f":"IF(L92=\"\",M92,IF(M92=\"\",L92,\"\"))","v":""},{"$f":"IF(AND(OR(K92=\"EE\",K92=\"CE\"),N92=\"Simples\"),3,\nIF(AND(OR(K92=\"EE\",K92=\"CE\"),N92=\"Médio\"),4,\nIF(AND(OR(K92=\"EE\",K92=\"CE\"),N92=\"Complexo\"),6,\nIF(AND(K92=\"SE\",N92=\"Simples\"),4,\nIF(AND(K92=\"SE\",N92=\"Médio\"),5,\nIF(AND(K92=\"SE\",N92=\"Complexo\"),7,0))))))","v":0},{"$f":"IF(AND(K92=\"ALI\",M92=\"Simples\"),7,\nIF(AND(K92=\"ALI\",M92=\"Médio\"),10,\nIF(AND(K92=\"ALI\",M92=\"Complexo\"),15,\nIF(AND(K92=\"AIE\",M92=\"Simples\"),5,\nIF(AND(K92=\"AIE\",M92=\"Médio\"),7,\nIF(AND(K92=\"AIE\",M92=\"Complexo\"),10,0))))))","v":0},0]
[null,null,{"$f":"IF(B93<>\"\",VLOOKUP(B93,'Tipo Projeto'!$A$3:$B$36,2,0),0)","v":0},null,null,null,null,null,null,null,null,{"$f":"IF(K93=\"EE\",IF(OR(AND(OR(J93=1,J93=0),I93>0,I93<5),AND(OR(J93=1,J93=0),I93>4,I93<16),AND(J93=2,I93>0,I93<5)),\"Simples\",IF(OR(AND(OR(J93=1,J93=0),I93>15),AND(J93=2,I93>4,I93<16),AND(J93>2,I93>0,I93<5)),\"Médio\",IF(OR(AND(J93=2,I93>15),AND(J93>2,I93>4,I93<16),AND(J93>2,I93>15)),\"Complexo\",\"\"))),\nIF(OR(K93=\"CE\",K93=\"SE\"),IF(OR(AND(OR(J93=1,J93=0),I93>0,I93<6),AND(OR(J93=1,J93=0),I93>5,I93<20),AND(J93>1,J93<4,I93>0,I93<6)),\"Simples\",IF(OR(AND(OR(J93=1,J93=0),I93>19),AND(J93>1,J93<4,I93>5,I93<20),AND(J93>3,I93>0,I93<6)),\"Médio\",IF(OR(AND(J93>1,J93<4,I93>19),AND(J93>3,I93>5,I93<20),AND(J93>3,I93>19)),\"Complexo\",\"\"))),\"\"))","v":""},{"$f":"IF(K93=\"ALI\",IF(OR(AND(OR(J93=1,J93=0),I93>0,I93<20),AND(OR(J93=1,J93=0),I93>19,I93<51),AND(J93>1,J93<6,I93>0,I93<20)),\"Simples\",IF(OR(AND(OR(J93=1,J93=0),I93>50),AND(J93>1,J93<6,I93>19,I93<51),AND(J93>5,I93>0,I93<20)),\"Médio\",IF(OR(AND(J93>1,J93<6,I93>50),AND(J93>5,I93>19,I93<51),AND(J93>5,I93>50)),\"Complexo\",\"\"))),\nIF(K93=\"AIE\",IF(OR(AND(OR(J93=1, J93=0),I93>0,I93<20),AND(OR(J93=1, J93=0),I93>19,I93<51),AND(J93>1,J93<6,I93>0,I93<20)),\"Simples\",IF(OR(AND(OR(J93=1, J93=0),I93>50),AND(J93>1,J93<6,I93>19,I93<51),AND(J93>5,I93>0,I93<20)),\"Médio\",IF(OR(AND(J93>1,J93<6,I93>50),AND(J93>5,I93>19,I93<51),AND(J93>5,I93>50)),\"Complexo\",\"\"))),\"\"))","v":""},{"$f":"IF(L93=\"\",M93,IF(M93=\"\",L93,\"\"))","v":""},{"$f":"IF(AND(OR(K93=\"EE\",K93=\"CE\"),N93=\"Simples\"),3,\nIF(AND(OR(K93=\"EE\",K93=\"CE\"),N93=\"Médio\"),4,\nIF(AND(OR(K93=\"EE\",K93=\"CE\"),N93=\"Complexo\"),6,\nIF(AND(K93=\"SE\",N93=\"Simples\"),4,\nIF(AND(K93=\"SE\",N93=\"Médio\"),5,\nIF(AND(K93=\"SE\",N93=\"Complexo\"),7,0))))))","v":0},{"$f":"IF(AND(K93=\"ALI\",M93=\"Simples\"),7,\nIF(AND(K93=\"ALI\",M93=\"Médio\"),10,\nIF(AND(K93=\"ALI\",M93=\"Complexo\"),15,\nIF(AND(K93=\"AIE\",M93=\"Simples\"),5,\nIF(AND(K93=\"AIE\",M93=\"Médio\"),7,\nIF(AND(K93=\"AIE\",M93=\"Complexo\"),10,0))))))","v":0},0]
[null,null,{"$f":"IF(B94<>\"\",VLOOKUP(B94,'Tipo Projeto'!$A$3:$B$36,2,0),0)","v":0},null,null,null,null,null,null,null,null,"","","",0,0,0]
[null,null,{"$f":"IF(B95<>\"\",VLOOKUP(B95,'Tipo Projeto'!$A$3:$B$36,2,0),0)","v":0},null,null,null,null,null,null,null,null,"","","",0,0,0]
[null,null,{"$f":"IF(B96<>\"\",VLOOKUP(B96,'Tipo Projeto'!$A$3:$B$36,2,0),0)","v":0},null,null,null,null,null,null,null,null,"","","",0,0,0]
[null,null,{"$f":"IF(B97<>\"\",VLOOKUP(B97,'Tipo Projeto'!$A$3:$B$36,2,0),0)","v":0},null,null,null,null,null,null,null,null,"","","",0,0,0]
[null,null,{"$f":"IF(B98<>\"\",VLOOKUP(B98,'Tipo Projeto'!$A$3:$B$36,2,0),0)","v":0},null,null,null,null,null,null,null,null,"","","",0,0,0]
[null,null,{"$f":"IF(B99<>\"\",VLOOKUP(B99,'Tipo Projeto'!$A$3:$B$36,2,0),0)","v":0},null,null,null,null,null,null,null,null,{"$f":"IF(K99=\"EE\",IF(OR(AND(OR(J99=1,J99=0),I99>0,I99<5),AND(OR(J99=1,J99=0),I99>4,I99<16),AND(J99=2,I99>0,I99<5)),\"Simples\",IF(OR(AND(OR(J99=1,J99=0),I99>15),AND(J99=2,I99>4,I99<16),AND(J99>2,I99>0,I99<5)),\"Médio\",IF(OR(AND(J99=2,I99>15),AND(J99>2,I99>4,I99<16),AND(J99>2,I99>15)),\"Complexo\",\"\"))),\nIF(OR(K99=\"CE\",K99=\"SE\"),IF(OR(AND(OR(J99=1,J99=0),I99>0,I99<6),AND(OR(J99=1,J99=0),I99>5,I99<20),AND(J99>1,J99<4,I99>0,I99<6)),\"Simples\",IF(OR(AND(OR(J99=1,J99=0),I99>19),AND(J99>1,J99<4,I99>5,I99<20),AND(J99>3,I99>0,I99<6)),\"Médio\",IF(OR(AND(J99>1,J99<4,I99>19),AND(J99>3,I99>5,I99<20),AND(J99>3,I99>19)),\"Complexo\",\"\"))),\"\"))","v":""},{"$f":"IF(K99=\"ALI\",IF(OR(AND(OR(J99=1,J99=0),I99>0,I99<20),AND(OR(J99=1,J99=0),I99>19,I99<51),AND(J99>1,J99<6,I99>0,I99<20)),\"Simples\",IF(OR(AND(OR(J99=1,J99=0),I99>50),AND(J99>1,J99<6,I99>19,I99<51),AND(J99>5,I99>0,I99<20)),\"Médio\",IF(OR(AND(J99>1,J99<6,I99>50),AND(J99>5,I99>19,I99<51),AND(J99>5,I99>50)),\"Complexo\",\"\"))),\nIF(K99=\"AIE\",IF(OR(AND(OR(J99=1, J99=0),I99>0,I99<20),AND(OR(J99=1, J99=0),I99>19,I99<51),AND(J99>1,J99<6,I99>0,I99<20)),\"Simples\",IF(OR(AND(OR(J99=1, J99=0),I99>50),AND(J99>1,J99<6,I99>19,I99<51),AND(J99>5,I99>0,I99<20)),\"Médio\",IF(OR(AND(J99>1,J99<6,I99>50),AND(J99>5,I99>19,I99<51),AND(J99>5,I99>50)),\"Complexo\",\"\"))),\"\"))","v":""},{"$f":"IF(L99=\"\",M99,IF(M99=\"\",L99,\"\"))","v":""},{"$f":"IF(AND(OR(K99=\"EE\",K99=\"CE\"),N99=\"Simples\"),3,\nIF(AND(OR(K99=\"EE\",K99=\"CE\"),N99=\"Médio\"),4,\nIF(AND(OR(K99=\"EE\",K99=\"CE\"),N99=\"Complexo\"),6,\nIF(AND(K99=\"SE\",N99=\"Simples\"),4,\nIF(AND(K99=\"SE\",N99=\"Médio\"),5,\nIF(AND(K99=\"SE\",N99=\"Complexo\"),7,0))))))","v":0},{"$f":"IF(AND(K99=\"ALI\",M99=\"Simples\"),7,\nIF(AND(K99=\"ALI\",M99=\"Médio\"),10,\nIF(AND(K99=\"ALI\",M99=\"Complexo\"),15,\nIF(AND(K99=\"AIE\",M99=\"Simples\"),5,\nIF(AND(K99=\"AIE\",M99=\"Médio\"),7,\nIF(AND(K99=\"AIE\",M99=\"Complexo\"),10,0))))))","v":0},0]
[null,null,{"$f":"IF(B100<>\"\",VLOOKUP(B100,'Tipo Projeto'!$A$3:$B$36,2,0),0)","v":0},null,null,null,null,null,null,null,null,"","","",0,0,0]
[null,null,{"$f":"IF(B101<>\"\",VLOOKUP(B101,'Tipo Projeto'!$A$3:$B$36,2,0),0)","v":0},null,null,null,null,null,null,null,null,"","","",0,0,0]
[null,null,{"$f":"IF(B102<>\"\",VLOOKUP(B102,'Tipo Projeto'!$A$3:$B$36,2,0),0)","v":0},null,null,null,null,null,null,null,null,"","","",0,0,0]
[null,null,{"$f":"IF(B103<>\"\",VLOOKUP(B103,'Tipo Projeto'!$A$3:$B$36,2,0),0)","v":0},null,null,null,null,null,null,null,null,"","","",0,0,0]
[null,null,{"$f":"IF(B104<>\"\",VLOOKUP(B104,'Tipo Projeto'!$A$3:$B$36,2,0),0)","v":0},null,null,null,null,null,null,null,null,"","","",0,0,0]
[null,null,{"$f":"IF(B105<>\"\",VLOOKUP(B105,'Tipo Projeto'!$A$3:$B$36,2,0),0)","v":0},null,null,null,null,null,null,null,null,"","","",0,0,0]
[null,null,{"$f":"IF(B106<>\"\",VLOOKUP(B106,'Tipo Projeto'!$A$3:$B$36,2,0),0)","v":0},null,null,null,null,null,null,null,null,{"$f":"IF(K106=\"EE\",IF(OR(AND(OR(J106=1,J106=0),I106>0,I106<5),AND(OR(J106=1,J106=0),I106>4,I106<16),AND(J106=2,I106>0,I106<5)),\"Simples\",IF(OR(AND(OR(J106=1,J106=0),I106>15),AND(J106=2,I106>4,I106<16),AND(J106>2,I106>0,I106<5)),\"Médio\",IF(OR(AND(J106=2,I106>15),AND(J106>2,I106>4,I106<16),AND(J106>2,I106>15)),\"Complexo\",\"\"))),\nIF(OR(K106=\"CE\",K106=\"SE\"),IF(OR(AND(OR(J106=1,J106=0),I106>0,I106<6),AND(OR(J106=1,J106=0),I106>5,I106<20),AND(J106>1,J106<4,I106>0,I106<6)),\"Simples\",IF(OR(AND(OR(J106=1,J106=0),I106>19),AND(J106>1,J106<4,I106>5,I106<20),AND(J106>3,I106>0,I106<6)),\"Médio\",IF(OR(AND(J106>1,J106<4,I106>19),AND(J106>3,I106>5,I106<20),AND(J106>3,I106>19)),\"Complexo\",\"\"))),\"\"))","v":""},{"$f":"IF(K106=\"ALI\",IF(OR(AND(OR(J106=1,J106=0),I106>0,I106<20),AND(OR(J106=1,J106=0),I106>19,I106<51),AND(J106>1,J106<6,I106>0,I106<20)),\"Simples\",IF(OR(AND(OR(J106=1,J106=0),I106>50),AND(J106>1,J106<6,I106>19,I106<51),AND(J106>5,I106>0,I106<20)),\"Médio\",IF(OR(AND(J106>1,J106<6,I106>50),AND(J106>5,I106>19,I106<51),AND(J106>5,I106>50)),\"Complexo\",\"\"))),\nIF(K106=\"AIE\",IF(OR(AND(OR(J106=1, J106=0),I106>0,I106<20),AND(OR(J106=1, J106=0),I106>19,I106<51),AND(J106>1,J106<6,I106>0,I106<20)),\"Simples\",IF(OR(AND(OR(J106=1, J106=0),I106>50),AND(J106>1,J106<6,I106>19,I106<51),AND(J106>5,I106>0,I106<20)),\"Médio\",IF(OR(AND(J106>1,J106<6,I106>50),AND(J106>5,I106>19,I106<51),AND(J106>5,I106>50)),\"Complexo\",\"\"))),\"\"))","v":""},"",{"$f":"IF(AND(OR(K106=\"EE\",K106=\"CE\"),N106=\"Simples\"),3,\nIF(AND(OR(K106=\"EE\",K106=\"CE\"),N106=\"Médio\"),4,\nIF(AND(OR(K106=\"EE\",K106=\"CE\"),N106=\"Complexo\"),6,\nIF(AND(K106=\"SE\",N106=\"Simples\"),4,\nIF(AND(K106=\"SE\",N106=\"Médio\"),5,\nIF(AND(K106=\"SE\",N106=\"Complexo\"),7,0))))))","v":0},{"$f":"IF(AND(K106=\"ALI\",M106=\"Simples\"),7,\nIF(AND(K106=\"ALI\",M106=\"Médio\"),10,\nIF(AND(K106=\"ALI\",M106=\"Complexo\"),15,\nIF(AND(K106=\"AIE\",M106=\"Simples\"),5,\nIF(AND(K106=\"AIE\",M106=\"Médio\"),7,\nIF(AND(K106=\"AIE\",M106=\"Complexo\"),10,0))))))","v":0},0]
[null,null,{"$f":"IF(B107<>\"\",VLOOKUP(B107,'Tipo Projeto'!$A$3:$B$36,2,0),0)","v":0},null,null,null,null,null,null,null,null,"","",{"$f":"IF(L107=\"\",M107,IF(M107=\"\",L107,\"\"))","v":""},0,0,0]
[null,null,{"$f":"IF(B108<>\"\",VLOOKUP(B108,'Tipo Projeto'!$A$3:$B$36,2,0),0)","v":0},null,null,null,null,null,null,null,null,"","","",0,0,0]
[null,null,{"$f":"IF(B109<>\"\",VLOOKUP(B109,'Tipo Projeto'!$A$3:$B$36,2,0),0)","v":0},null,null,null,null,null,null,null,null,"","","",0,0,0]
[null,null,{"$f":"IF(B110<>\"\",VLOOKUP(B110,'Tipo Projeto'!$A$3:$B$36,2,0),0)","v":0},null,null,null,null,null,null,null,null,"","","",0,0,0]
[null,null,{"$f":"IF(B111<>\"\",VLOOKUP(B111,'Tipo Projeto'!$A$3:$B$36,2,0),0)","v":0},null,null,null,null,null,null,null,null,"","","",0,0,0]
[null,null,{"$f":"IF(B112<>\"\",VLOOKUP(B112,'Tipo Projeto'!$A$3:$B$36,2,0),0)","v":0},null,null,null,null,null,null,null,null,"","","",0,0,0]
[null,null,{"$f":"IF(B113<>\"\",VLOOKUP(B113,'Tipo Projeto'!$A$3:$B$36,2,0),0)","v":0},null,null,null,null,null,null,null,null,"","","",0,0,0]
[null,null,{"$f":"IF(B114<>\"\",VLOOKUP(B114,'Tipo Projeto'!$A$3:$B$36,2,0),0)","v":0},null,null,null,null,null,null,null,null,"","","",0,0,0]
[null,null,{"$f":"IF(B115<>\"\",VLOOKUP(B115,'Tipo Projeto'!$A$3:$B$36,2,0),0)","v":0},null,null,null,null,null,null,null,null,"","","",0,0,0]
[null,null,{"$f":"IF(B116<>\"\",VLOOKUP(B116,'Tipo Projeto'!$A$3:$B$36,2,0),0)","v":0},null,null,null,null,null,null,null,null,"","","",0,0,0]
[null,null,{"$f":"IF(B117<>\"\",VLOOKUP(B117,'Tipo Projeto'!$A$3:$B$36,2,0),0)","v":0},null,null,null,null,null,null,null,null,"","","",0,0,0]
[null,null,{"$f":"IF(B118<>\"\",VLOOKUP(B118,'Tipo Projeto'!$A$3:$B$36,2,0),0)","v":0},null,null,null,null,null,null,null,null,"","","",0,0,0]
[null,null,{"$f":"IF(B119<>\"\",VLOOKUP(B119,'Tipo Projeto'!$A$3:$B$36,2,0),0)","v":0},null,null,null,null,null,null,null,null,"","","",0,0,0]
[null,null,{"$f":"IF(B120<>\"\",VLOOKUP(B120,'Tipo Projeto'!$A$3:$B$36,2,0),0)","v":0},null,null,null,null,null,null,null,null,"","","",0,0,0]
[null,null,{"$f":"IF(B121<>\"\",VLOOKUP(B121,'Tipo Projeto'!$A$3:$B$36,2,0),0)","v":0},null,null,null,null,null,null,null,null,"","","",0,0,0]
[null,null,{"$f":"IF(B122<>\"\",VLOOKUP(B122,'Tipo Projeto'!$A$3:$B$36,2,0),0)","v":0},null,null,null,null,null,null,null,null,"","","",0,0,0]
[null,null,{"$f":"IF(B123<>\"\",VLOOKUP(B123,'Tipo Projeto'!$A$3:$B$36,2,0),0)","v":0},null,null,null,null,null,null,null,null,"","","",0,0,0]
[null,null,{"$f":"IF(B124<>\"\",VLOOKUP(B124,'Tipo Projeto'!$A$3:$B$36,2,0),0)","v":0},null,null,null,null,null,null,null,null,"","","",0,0,0]
[null,null,{"$f":"IF(B125<>\"\",VLOOKUP(B125,'Tipo Projeto'!$A$3:$B$36,2,0),0)","v":0},null,null,null,null,null,null,null,null,"","","",0,0,0]
[null,null,{"$f":"IF(B126<>\"\",VLOOKUP(B126,'Tipo Projeto'!$A$3:$B$36,2,0),0)","v":0},null,null,null,null,null,null,null,null,"","","",0,0,0]
[null,null,{"$f":"IF(B127<>\"\",VLOOKUP(B127,'Tipo Projeto'!$A$3:$B$36,2,0),0)","v":0},null,null,null,null,null,null,null,null,"","","",0,0,0]
[null,null,{"$f":"IF(B128<>\"\",VLOOKUP(B128,'Tipo Projeto'!$A$3:$B$36,2,0),0)","v":0},null,null,null,null,null,null,null,null,"","","",0,0,0]
[null,null,{"$f":"IF(B129<>\"\",VLOOKUP(B129,'Tipo Projeto'!$A$3:$B$36,2,0),0)","v":0},null,null,null,null,null,null,null,null,"","","",0,0,0]
[null,null,{"$f":"IF(B130<>\"\",VLOOKUP(B130,'Tipo Projeto'!$A$3:$B$36,2,0),0)","v":0},null,null,null,null,null,null,null,null,"","","",0,0,0]
[null,null,{"$f":"IF(B131<>\"\",VLOOKUP(B131,'Tipo Projeto'!$A$3:$B$36,2,0),0)","v":0},null,null,null,null,null,null,null,null,"","","",0,0,0]
[null,null,{"$f":"IF(B132<>\"\",VLOOKUP(B132,'Tipo Projeto'!$A$3:$B$36,2,0),0)","v":0},null,null,null,null,null,null,null,null,"","","",0,0,0]
[null,null,{"$f":"IF(B133<>\"\",VLOOKUP(B133,'Tipo Projeto'!$A$3:$B$36,2,0),0)","v":0},null,null,null,null,null,null,null,null,"","","",0,0,0]
[null,null,{"$f":"IF(B134<>\"\",VLOOKUP(B134,'Tipo Projeto'!$A$3:$B$36,2,0),0)","v":0},null,null,null,null,null,null,null,null,"","","",0,0,0]
[null,null,{"$f":"IF(B135<>\"\",VLOOKUP(B135,'Tipo Projeto'!$A$3:$B$36,2,0),0)","v":0},null,null,null,null,null,null,null,null,"","","",0,0,0]
[null,null,{"$f":"IF(B136<>\"\",VLOOKUP(B136,'Tipo Projeto'!$A$3:$B$36,2,0),0)","v":0},null,null,null,null,null,null,null,null,"","","",0,0,0]
[null,null,{"$f":"IF(B137<>\"\",VLOOKUP(B137,'Tipo Projeto'!$A$3:$B$36,2,0),0)","v":0},null,null,null,null,null,null,null,null,"","","",0,0,0]
[null,null,{"$f":"IF(B138<>\"\",VLOOKUP(B138,'Tipo Projeto'!$A$3:$B$36,2,0),0)","v":0},null,null,null,null,null,null,null,null,"","","",0,0,0]
[null,null,{"$f":"IF(B139<>\"\",VLOOKUP(B139,'Tipo Projeto'!$A$3:$B$36,2,0),0)","v":0},null,null,null,null,null,null,null,null,"","","",0,0,{"$f":"IF(B139<>\"Manutenção em interface\",IF(B139<>\"Desenv., Manutenção e Publicação de Páginas Estáticas\",(O139+P139)*C139,C139),C139)","v":0}]
[null,null,{"$f":"IF(B140<>\"\",VLOOKUP(B140,'Tipo Projeto'!$A$3:$B$36,2,0),0)","v":0},null,null,null,null,null,null,null,null,"","","",0,0,0]
[null,null,{"$f":"IF(B141<>\"\",VLOOKUP(B141,'Tipo Projeto'!$A$3:$B$36,2,0),0)","v":0},null,null,null,null,null,null,null,null,"","","",0,0,0]
[null,null,{"$f":"IF(B142<>\"\",VLOOKUP(B142,'Tipo Projeto'!$A$3:$B$36,2,0),0)","v":0},null,null,null,null,null,null,null,null,"","","",0,0,0]
[null,null,{"$f":"IF(B143<>\"\",VLOOKUP(B143,'Tipo Projeto'!$A$3:$B$36,2,0),0)","v":0},null,null,null,null,null,null,null,null,"","","",0,0,0]
[null,null,{"$f":"IF(B144<>\"\",VLOOKUP(B144,'Tipo Projeto'!$A$3:$B$36,2,0),0)","v":0},null,null,null,null,null,null,null,null,"","","",0,0,0]
[null,null,{"$f":"IF(B145<>\"\",VLOOKUP(B145,'Tipo Projeto'!$A$3:$B$36,2,0),0)","v":0},null,null,null,null,null,null,null,null,"","","",0,0,0]
[null,null,{"$f":"IF(B146<>\"\",VLOOKUP(B146,'Tipo Projeto'!$A$3:$B$36,2,0),0)","v":0},null,null,null,null,null,null,null,null,"","","",0,0,0]
[null,null,{"$f":"IF(B147<>\"\",VLOOKUP(B147,'Tipo Projeto'!$A$3:$B$36,2,0),0)","v":0},null,null,null,null,null,null,null,null,"","","",0,0,0]
[null,null,{"$f":"IF(B148<>\"\",VLOOKUP(B148,'Tipo Projeto'!$A$3:$B$36,2,0),0)","v":0},null,null,null,null,null,null,null,null,"","","",0,0,0]
[null,null,{"$f":"IF(B149<>\"\",VLOOKUP(B149,'Tipo Projeto'!$A$3:$B$36,2,0),0)","v":0},null,null,null,null,null,null,null,null,"","","",0,0,0]
[null,null,{"$f":"IF(B150<>\"\",VLOOKUP(B150,'Tipo Projeto'!$A$3:$B$36,2,0),0)","v":0},null,null,null,null,null,null,null,null,"","","",0,0,0]
[null,null,{"$f":"IF(B151<>\"\",VLOOKUP(B151,'Tipo Projeto'!$A$3:$B$36,2,0),0)","v":0},null,null,null,null,null,null,null,null,"","","",0,0,0]
[null,null,{"$f":"IF(B152<>\"\",VLOOKUP(B152,'Tipo Projeto'!$A$3:$B$36,2,0),0)","v":0},null,null,null,null,null,null,null,null,"","","",0,0,0]
[null,null,{"$f":"IF(B153<>\"\",VLOOKUP(B153,'Tipo Projeto'!$A$3:$B$36,2,0),0)","v":0},null,null,null,null,null,null,null,null,"","","",0,0,0]
[null,null,{"$f":"IF(B154<>\"\",VLOOKUP(B154,'Tipo Projeto'!$A$3:$B$36,2,0),0)","v":0},null,null,null,null,null,null,null,null,"","","",0,0,0]
[null,null,{"$f":"IF(B155<>\"\",VLOOKUP(B155,'Tipo Projeto'!$A$3:$B$36,2,0),0)","v":0},null,null,null,null,null,null,null,null,"","","",0,0,0]
[null,null,{"$f":"IF(B156<>\"\",VLOOKUP(B156,'Tipo Projeto'!$A$3:$B$36,2,0),0)","v":0},null,null,null,null,null,null,null,null,"","","",0,0,0]
[null,null,{"$f":"IF(B157<>\"\",VLOOKUP(B157,'Tipo Projeto'!$A$3:$B$36,2,0),0)","v":0},null,null,null,null,null,null,null,null,"","","",0,0,0]
[null,null,{"$f":"IF(B158<>\"\",VLOOKUP(B158,'Tipo Projeto'!$A$3:$B$36,2,0),0)","v":0},null,null,null,null,null,null,null,null,"","","",0,0,0]
[null,null,{"$f":"IF(B159<>\"\",VLOOKUP(B159,'Tipo Projeto'!$A$3:$B$36,2,0),0)","v":0},null,null,null,null,null,null,null,null,"","","",0,0,0]
[null,null,{"$f":"IF(B160<>\"\",VLOOKUP(B160,'Tipo Projeto'!$A$3:$B$36,2,0),0)","v":0},null,null,null,null,null,null,null,null,"","","",0,0,0]
[null,null,{"$f":"IF(B161<>\"\",VLOOKUP(B161,'Tipo Projeto'!$A$3:$B$36,2,0),0)","v":0},null,null,null,null,null,null,null,null,"","","",0,0,0]
[null,null,{"$f":"IF(B162<>\"\",VLOOKUP(B162,'Tipo Projeto'!$A$3:$B$36,2,0),0)","v":0},null,null,null,null,null,null,null,null,"","","",0,0,0]
[null,null,{"$f":"IF(B163<>\"\",VLOOKUP(B163,'Tipo Projeto'!$A$3:$B$36,2,0),0)","v":0},null,null,null,null,null,null,null,null,"","","",0,0,0]
[null,null,{"$f":"IF(B164<>\"\",VLOOKUP(B164,'Tipo Projeto'!$A$3:$B$36,2,0),0)","v":0},null,null,null,null,null,null,null,null,"","","",0,0,0]
[null,null,{"$f":"IF(B165<>\"\",VLOOKUP(B165,'Tipo Projeto'!$A$3:$B$36,2,0),0)","v":0},null,null,null,null,null,null,null,null,"","","",0,0,0]
[null,null,{"$f":"IF(B166<>\"\",VLOOKUP(B166,'Tipo Projeto'!$A$3:$B$36,2,0),0)","v":0},null,null,null,null,null,null,null,null,"","","",0,0,0]
[null,null,{"$f":"IF(B167<>\"\",VLOOKUP(B167,'Tipo Projeto'!$A$3:$B$36,2,0),0)","v":0},null,null,null,null,null,null,null,null,"","","",0,0,0]
[null,null,{"$f":"IF(B168<>\"\",VLOOKUP(B168,'Tipo Projeto'!$A$3:$B$36,2,0),0)","v":0},null,null,null,null,null,null,null,null,"","","",0,0,0]
[null,null,{"$f":"IF(B169<>\"\",VLOOKUP(B169,'Tipo Projeto'!$A$3:$B$36,2,0),0)","v":0},null,null,null,null,null,null,null,null,"","","",0,0,0]
[null,null,{"$f":"IF(B170<>\"\",VLOOKUP(B170,'Tipo Projeto'!$A$3:$B$36,2,0),0)","v":0},null,null,null,null,null,null,null,null,{"$f":"IF(K170=\"EE\",IF(OR(AND(OR(J170=1,J170=0),I170>0,I170<5),AND(OR(J170=1,J170=0),I170>4,I170<16),AND(J170=2,I170>0,I170<5)),\"Simples\",IF(OR(AND(OR(J170=1,J170=0),I170>15),AND(J170=2,I170>4,I170<16),AND(J170>2,I170>0,I170<5)),\"Médio\",IF(OR(AND(J170=2,I170>15),AND(J170>2,I170>4,I170<16),AND(J170>2,I170>15)),\"Complexo\",\"\"))),\nIF(OR(K170=\"CE\",K170=\"SE\"),IF(OR(AND(OR(J170=1,J170=0),I170>0,I170<6),AND(OR(J170=1,J170=0),I170>5,I170<20),AND(J170>1,J170<4,I170>0,I170<6)),\"Simples\",IF(OR(AND(OR(J170=1,J170=0),I170>19),AND(J170>1,J170<4,I170>5,I170<20),AND(J170>3,I170>0,I170<6)),\"Médio\",IF(OR(AND(J170>1,J170<4,I170>19),AND(J170>3,I170>5,I170<20),AND(J170>3,I170>19)),\"Complexo\",\"\"))),\"\"))","v":""},{"$f":"IF(K170=\"ALI\",IF(OR(AND(OR(J170=1,J170=0),I170>0,I170<20),AND(OR(J170=1,J170=0),I170>19,I170<51),AND(J170>1,J170<6,I170>0,I170<20)),\"Simples\",IF(OR(AND(OR(J170=1,J170=0),I170>50),AND(J170>1,J170<6,I170>19,I170<51),AND(J170>5,I170>0,I170<20)),\"Médio\",IF(OR(AND(J170>1,J170<6,I170>50),AND(J170>5,I170>19,I170<51),AND(J170>5,I170>50)),\"Complexo\",\"\"))),\nIF(K170=\"AIE\",IF(OR(AND(OR(J170=1, J170=0),I170>0,I170<20),AND(OR(J170=1, J170=0),I170>19,I170<51),AND(J170>1,J170<6,I170>0,I170<20)),\"Simples\",IF(OR(AND(OR(J170=1, J170=0),I170>50),AND(J170>1,J170<6,I170>19,I170<51),AND(J170>5,I170>0,I170<20)),\"Médio\",IF(OR(AND(J170>1,J170<6,I170>50),AND(J170>5,I170>19,I170<51),AND(J170>5,I170>50)),\"Complexo\",\"\"))),\"\"))","v":""},"",{"$f":"IF(AND(OR(K170=\"EE\",K170=\"CE\"),N170=\"Simples\"),3,\nIF(AND(OR(K170=\"EE\",K170=\"CE\"),N170=\"Médio\"),4,\nIF(AND(OR(K170=\"EE\",K170=\"CE\"),N170=\"Complexo\"),6,\nIF(AND(K170=\"SE\",N170=\"Simples\"),4,\nIF(AND(K170=\"SE\",N170=\"Médio\"),5,\nIF(AND(K170=\"SE\",N170=\"Complexo\"),7,0))))))","v":0},{"$f":"IF(AND(K170=\"ALI\",M170=\"Simples\"),7,\nIF(AND(K170=\"ALI\",M170=\"Médio\"),10,\nIF(AND(K170=\"ALI\",M170=\"Complexo\"),15,\nIF(AND(K170=\"AIE\",M170=\"Simples\"),5,\nIF(AND(K170=\"AIE\",M170=\"Médio\"),7,\nIF(AND(K170=\"AIE\",M170=\"Complexo\"),10,0))))))","v":0},0]
[null,null,{"$f":"IF(B171<>\"\",VLOOKUP(B171,'Tipo Projeto'!$A$3:$B$36,2,0),0)","v":0},null,null,null,null,null,null,null,null,"","",{"$f":"IF(L171=\"\",M171,IF(M171=\"\",L171,\"\"))","v":""},0,0,0]
[null,null,{"$f":"IF(B172<>\"\",VLOOKUP(B172,'Tipo Projeto'!$A$3:$B$36,2,0),0)","v":0},null,null,null,null,null,null,null,null,"","","",0,0,0]
[null,null,{"$f":"IF(B173<>\"\",VLOOKUP(B173,'Tipo Projeto'!$A$3:$B$36,2,0),0)","v":0},null,null,null,null,null,null,null,null,"","","",0,0,0]
[null,null,{"$f":"IF(B174<>\"\",VLOOKUP(B174,'Tipo Projeto'!$A$3:$B$36,2,0),0)","v":0},null,null,null,null,null,null,null,null,"","","",0,0,0]
[null,null,{"$f":"IF(B175<>\"\",VLOOKUP(B175,'Tipo Projeto'!$A$3:$B$36,2,0),0)","v":0},null,null,null,null,null,null,null,null,"","","",0,0,0]
[null,null,{"$f":"IF(B176<>\"\",VLOOKUP(B176,'Tipo Projeto'!$A$3:$B$36,2,0),0)","v":0},null,null,null,null,null,null,null,null,"","","",0,0,0]
[null,null,{"$f":"IF(B177<>\"\",VLOOKUP(B177,'Tipo Projeto'!$A$3:$B$36,2,0),0)","v":0},null,null,null,null,null,null,null,null,"","","",0,0,0]
[null,null,{"$f":"IF(B178<>\"\",VLOOKUP(B178,'Tipo Projeto'!$A$3:$B$36,2,0),0)","v":0},null,null,null,null,null,null,null,null,"","","",0,0,0]
[null,null,{"$f":"IF(B179<>\"\",VLOOKUP(B179,'Tipo Projeto'!$A$3:$B$36,2,0),0)","v":0},null,null,null,null,null,null,null,null,"","","",0,0,0]
[null,null,{"$f":"IF(B180<>\"\",VLOOKUP(B180,'Tipo Projeto'!$A$3:$B$36,2,0),0)","v":0},null,null,null,null,null,null,null,null,"","","",0,0,0]
[null,null,{"$f":"IF(B181<>\"\",VLOOKUP(B181,'Tipo Projeto'!$A$3:$B$36,2,0),0)","v":0},null,null,null,null,null,null,null,null,"","","",0,0,0]
[null,null,{"$f":"IF(B182<>\"\",VLOOKUP(B182,'Tipo Projeto'!$A$3:$B$36,2,0),0)","v":0},null,null,null,null,null,null,null,null,"","","",0,0,0]
[null,null,{"$f":"IF(B183<>\"\",VLOOKUP(B183,'Tipo Projeto'!$A$3:$B$36,2,0),0)","v":0},null,null,null,null,null,null,null,null,"","","",0,0,0]
[null,null,{"$f":"IF(B184<>\"\",VLOOKUP(B184,'Tipo Projeto'!$A$3:$B$36,2,0),0)","v":0},null,null,null,null,null,null,null,null,"","","",0,0,0]
[null,null,{"$f":"IF(B185<>\"\",VLOOKUP(B185,'Tipo Projeto'!$A$3:$B$36,2,0),0)","v":0},null,null,null,null,null,null,null,null,"","","",0,0,0]
[null,null,{"$f":"IF(B186<>\"\",VLOOKUP(B186,'Tipo Projeto'!$A$3:$B$36,2,0),0)","v":0},null,null,null,null,null,null,null,null,"","","",0,0,0]
[null,null,{"$f":"IF(B187<>\"\",VLOOKUP(B187,'Tipo Projeto'!$A$3:$B$36,2,0),0)","v":0},null,null,null,null,null,null,null,null,"","","",0,0,0]
[null,null,{"$f":"IF(B188<>\"\",VLOOKUP(B188,'Tipo Projeto'!$A$3:$B$36,2,0),0)","v":0},null,null,null,null,null,null,null,null,"","","",0,0,0]
[null,null,{"$f":"IF(B189<>\"\",VLOOKUP(B189,'Tipo Projeto'!$A$3:$B$36,2,0),0)","v":0},null,null,null,null,null,null,null,null,"","","",0,0,0]
[null,null,{"$f":"IF(B190<>\"\",VLOOKUP(B190,'Tipo Projeto'!$A$3:$B$36,2,0),0)","v":0},null,null,null,null,null,null,null,null,"","","",0,0,0]
[null,null,{"$f":"IF(B191<>\"\",VLOOKUP(B191,'Tipo Projeto'!$A$3:$B$36,2,0),0)","v":0},null,null,null,null,null,null,null,null,"","","",0,0,0]
[null,null,{"$f":"IF(B192<>\"\",VLOOKUP(B192,'Tipo Projeto'!$A$3:$B$36,2,0),0)","v":0},null,null,null,null,null,null,null,null,"","","",0,0,0]
[null,null,{"$f":"IF(B193<>\"\",VLOOKUP(B193,'Tipo Projeto'!$A$3:$B$36,2,0),0)","v":0},null,null,null,null,null,null,null,null,"","","",0,0,0]
[null,null,{"$f":"IF(B194<>\"\",VLOOKUP(B194,'Tipo Projeto'!$A$3:$B$36,2,0),0)","v":0},null,null,null,null,null,null,null,null,"","","",0,0,0]
[null,null,{"$f":"IF(B195<>\"\",VLOOKUP(B195,'Tipo Projeto'!$A$3:$B$36,2,0),0)","v":0},null,null,null,null,null,null,null,null,"","","",0,0,0]
[null,null,{"$f":"IF(B196<>\"\",VLOOKUP(B196,'Tipo Projeto'!$A$3:$B$36,2,0),0)","v":0},null,null,null,null,null,null,null,null,"","","",0,0,0]
[null,null,{"$f":"IF(B197<>\"\",VLOOKUP(B197,'Tipo Projeto'!$A$3:$B$36,2,0),0)","v":0},null,null,null,null,null,null,null,null,"","","",0,0,0]
[null,null,{"$f":"IF(B198<>\"\",VLOOKUP(B198,'Tipo Projeto'!$A$3:$B$36,2,0),0)","v":0},null,null,null,null,null,null,null,null,"","","",0,0,0]
[null,null,{"$f":"IF(B199<>\"\",VLOOKUP(B199,'Tipo Projeto'!$A$3:$B$36,2,0),0)","v":0},null,null,null,null,null,null,null,null,"","","",0,0,0]
[null,null,{"$f":"IF(B200<>\"\",VLOOKUP(B200,'Tipo Projeto'!$A$3:$B$36,2,0),0)","v":0},null,null,null,null,null,null,null,null,"","","",0,0,0]
[null,null,{"$f":"IF(B201<>\"\",VLOOKUP(B201,'Tipo Projeto'!$A$3:$B$36,2,0),0)","v":0},null,null,null,null,null,null,null,null,"","","",0,0,0]
[null,null,{"$f":"IF(B202<>\"\",VLOOKUP(B202,'Tipo Projeto'!$A$3:$B$36,2,0),0)","v":0},null,null,null,null,null,null,null,null,"","","",0,0,0]
[null,null,{"$f":"IF(B203<>\"\",VLOOKUP(B203,'Tipo Projeto'!$A$3:$B$36,2,0),0)","v":0},null,null,null,null,null,null,null,null,"","","",0,0,{"$f":"IF(B203<>\"Manutenção em interface\",IF(B203<>\"Desenv., Manutenção e Publicação de Páginas Estáticas\",(O203+P203)*C203,C203),C203)","v":0}]
[null,null,{"$f":"IF(B204<>\"\",VLOOKUP(B204,'Tipo Projeto'!$A$3:$B$36,2,0),0)","v":0},null,null,null,null,null,null,null,null,"","","",0,0,0]
[null,null,{"$f":"IF(B205<>\"\",VLOOKUP(B205,'Tipo Projeto'!$A$3:$B$36,2,0),0)","v":0},null,null,null,null,null,null,null,null,"","","",0,0,0]
[null,null,{"$f":"IF(B206<>\"\",VLOOKUP(B206,'Tipo Projeto'!$A$3:$B$36,2,0),0)","v":0},null,null,null,null,null,null,null,null,"","","",0,0,0]
[null,null,{"$f":"IF(B207<>\"\",VLOOKUP(B207,'Tipo Projeto'!$A$3:$B$36,2,0),0)","v":0},null,null,null,null,null,null,null,null,"","","",0,0,0]
[null,null,{"$f":"IF(B208<>\"\",VLOOKUP(B208,'Tipo Projeto'!$A$3:$B$36,2,0),0)","v":0},null,null,null,null,null,null,null,null,"","","",0,0,0]
[null,null,{"$f":"IF(B209<>\"\",VLOOKUP(B209,'Tipo Projeto'!$A$3:$B$36,2,0),0)","v":0},null,null,null,null,null,null,null,null,"","","",0,0,0]
[null,null,{"$f":"IF(B210<>\"\",VLOOKUP(B210,'Tipo Projeto'!$A$3:$B$36,2,0),0)","v":0},null,null,null,null,null,null,null,null,"","","",0,0,0]
[null,null,{"$f":"IF(B211<>\"\",VLOOKUP(B211,'Tipo Projeto'!$A$3:$B$36,2,0),0)","v":0},null,null,null,null,null,null,null,null,"","","",0,0,0]
[null,null,{"$f":"IF(B212<>\"\",VLOOKUP(B212,'Tipo Projeto'!$A$3:$B$36,2,0),0)","v":0},null,null,null,null,null,null,null,null,"","","",0,0,0]
[null,null,{"$f":"IF(B213<>\"\",VLOOKUP(B213,'Tipo Projeto'!$A$3:$B$36,2,0),0)","v":0},null,null,null,null,null,null,null,null,"","","",0,0,0]
[null,null,{"$f":"IF(B214<>\"\",VLOOKUP(B214,'Tipo Projeto'!$A$3:$B$36,2,0),0)","v":0},null,null,null,null,null,null,null,null,"","","",0,0,0]
[null,null,{"$f":"IF(B215<>\"\",VLOOKUP(B215,'Tipo Projeto'!$A$3:$B$36,2,0),0)","v":0},null,null,null,null,null,null,null,null,"","","",0,0,0]
[null,null,{"$f":"IF(B216<>\"\",VLOOKUP(B216,'Tipo Projeto'!$A$3:$B$36,2,0),0)","v":0},null,null,null,null,null,null,null,null,"","","",0,0,0]
[null,null,{"$f":"IF(B217<>\"\",VLOOKUP(B217,'Tipo Projeto'!$A$3:$B$36,2,0),0)","v":0},null,null,null,null,null,null,null,null,"","","",0,0,0]
[null,null,{"$f":"IF(B218<>\"\",VLOOKUP(B218,'Tipo Projeto'!$A$3:$B$36,2,0),0)","v":0},null,null,null,null,null,null,null,null,"","","",0,0,0]
[null,null,{"$f":"IF(B219<>\"\",VLOOKUP(B219,'Tipo Projeto'!$A$3:$B$36,2,0),0)","v":0},null,null,null,null,null,null,null,null,"","","",0,0,0]
[null,null,{"$f":"IF(B220<>\"\",VLOOKUP(B220,'Tipo Projeto'!$A$3:$B$36,2,0),0)","v":0},null,null,null,null,null,null,null,null,"","","",0,0,0]
[null,null,{"$f":"IF(B221<>\"\",VLOOKUP(B221,'Tipo Projeto'!$A$3:$B$36,2,0),0)","v":0},null,null,null,null,null,null,null,null,"","","",0,0,0]
[null,null,{"$f":"IF(B222<>\"\",VLOOKUP(B222,'Tipo Projeto'!$A$3:$B$36,2,0),0)","v":0},null,null,null,null,null,null,null,null,"","","",0,0,0]
[null,null,{"$f":"IF(B223<>\"\",VLOOKUP(B223,'Tipo Projeto'!$A$3:$B$36,2,0),0)","v":0},null,null,null,null,null,null,null,null,"","","",0,0,0]
[null,null,{"$f":"IF(B224<>\"\",VLOOKUP(B224,'Tipo Projeto'!$A$3:$B$36,2,0),0)","v":0},null,null,null,null,null,null,null,null,"","","",0,0,0]
[null,null,{"$f":"IF(B225<>\"\",VLOOKUP(B225,'Tipo Projeto'!$A$3:$B$36,2,0),0)","v":0},null,null,null,null,null,null,null,null,"","","",0,0,0]
[null,null,{"$f":"IF(B226<>\"\",VLOOKUP(B226,'Tipo Projeto'!$A$3:$B$36,2,0),0)","v":0},null,null,null,null,null,null,null,null,"","","",0,0,0]
[null,null,{"$f":"IF(B227<>\"\",VLOOKUP(B227,'Tipo Projeto'!$A$3:$B$36,2,0),0)","v":0},null,null,null,null,null,null,null,null,"","","",0,0,0]
[null,null,{"$f":"IF(B228<>\"\",VLOOKUP(B228,'Tipo Projeto'!$A$3:$B$36,2,0),0)","v":0},null,null,null,null,null,null,null,null,"","","",0,0,0]
[null,null,{"$f":"IF(B229<>\"\",VLOOKUP(B229,'Tipo Projeto'!$A$3:$B$36,2,0),0)","v":0},null,null,null,null,null,null,null,null,"","","",0,0,0]
[null,null,{"$f":"IF(B230<>\"\",VLOOKUP(B230,'Tipo Projeto'!$A$3:$B$36,2,0),0)","v":0},null,null,null,null,null,null,null,null,"","","",0,0,0]
[null,null,{"$f":"IF(B231<>\"\",VLOOKUP(B231,'Tipo Projeto'!$A$3:$B$36,2,0),0)","v":0},null,null,null,null,null,null,null,null,"","","",0,0,0]
[null,null,{"$f":"IF(B232<>\"\",VLOOKUP(B232,'Tipo Projeto'!$A$3:$B$36,2,0),0)","v":0},null,null,null,null,null,null,null,null,"","","",0,0,0]
[null,null,{"$f":"IF(B233<>\"\",VLOOKUP(B233,'Tipo Projeto'!$A$3:$B$36,2,0),0)","v":0},null,null,null,null,null,null,null,null,"","","",0,0,0]
[null,null,{"$f":"IF(B234<>\"\",VLOOKUP(B234,'Tipo Projeto'!$A$3:$B$36,2,0),0)","v":0},null,null,null,null,null,null,null,null,{"$f":"IF(K234=\"EE\",IF(OR(AND(OR(J234=1,J234=0),I234>0,I234<5),AND(OR(J234=1,J234=0),I234>4,I234<16),AND(J234=2,I234>0,I234<5)),\"Simples\",IF(OR(AND(OR(J234=1,J234=0),I234>15),AND(J234=2,I234>4,I234<16),AND(J234>2,I234>0,I234<5)),\"Médio\",IF(OR(AND(J234=2,I234>15),AND(J234>2,I234>4,I234<16),AND(J234>2,I234>15)),\"Complexo\",\"\"))),\nIF(OR(K234=\"CE\",K234=\"SE\"),IF(OR(AND(OR(J234=1,J234=0),I234>0,I234<6),AND(OR(J234=1,J234=0),I234>5,I234<20),AND(J234>1,J234<4,I234>0,I234<6)),\"Simples\",IF(OR(AND(OR(J234=1,J234=0),I234>19),AND(J234>1,J234<4,I234>5,I234<20),AND(J234>3,I234>0,I234<6)),\"Médio\",IF(OR(AND(J234>1,J234<4,I234>19),AND(J234>3,I234>5,I234<20),AND(J234>3,I234>19)),\"Complexo\",\"\"))),\"\"))","v":""},{"$f":"IF(K234=\"ALI\",IF(OR(AND(OR(J234=1,J234=0),I234>0,I234<20),AND(OR(J234=1,J234=0),I234>19,I234<51),AND(J234>1,J234<6,I234>0,I234<20)),\"Simples\",IF(OR(AND(OR(J234=1,J234=0),I234>50),AND(J234>1,J234<6,I234>19,I234<51),AND(J234>5,I234>0,I234<20)),\"Médio\",IF(OR(AND(J234>1,J234<6,I234>50),AND(J234>5,I234>19,I234<51),AND(J234>5,I234>50)),\"Complexo\",\"\"))),\nIF(K234=\"AIE\",IF(OR(AND(OR(J234=1, J234=0),I234>0,I234<20),AND(OR(J234=1, J234=0),I234>19,I234<51),AND(J234>1,J234<6,I234>0,I234<20)),\"Simples\",IF(OR(AND(OR(J234=1, J234=0),I234>50),AND(J234>1,J234<6,I234>19,I234<51),AND(J234>5,I234>0,I234<20)),\"Médio\",IF(OR(AND(J234>1,J234<6,I234>50),AND(J234>5,I234>19,I234<51),AND(J234>5,I234>50)),\"Complexo\",\"\"))),\"\"))","v":""},"",{"$f":"IF(AND(OR(K234=\"EE\",K234=\"CE\"),N234=\"Simples\"),3,\nIF(AND(OR(K234=\"EE\",K234=\"CE\"),N234=\"Médio\"),4,\nIF(AND(OR(K234=\"EE\",K234=\"CE\"),N234=\"Complexo\"),6,\nIF(AND(K234=\"SE\",N234=\"Simples\"),4,\nIF(AND(K234=\"SE\",N234=\"Médio\"),5,\nIF(AND(K234=\"SE\",N234=\"Complexo\"),7,0))))))","v":0},{"$f":"IF(AND(K234=\"ALI\",M234=\"Simples\"),7,\nIF(AND(K234=\"ALI\",M234=\"Médio\"),10,\nIF(AND(K234=\"ALI\",M234=\"Complexo\"),15,\nIF(AND(K234=\"AIE\",M234=\"Simples\"),5,\nIF(AND(K234=\"AIE\",M234=\"Médio\"),7,\nIF(AND(K234=\"AIE\",M234=\"Complexo\"),10,0))))))","v":0},0]
[null,null,{"$f":"IF(B235<>\"\",VLOOKUP(B235,'Tipo Projeto'!$A$3:$B$36,2,0),0)","v":0},null,null,null,null,null,null,null,null,"","",{"$f":"IF(L235=\"\",M235,IF(M235=\"\",L235,\"\"))","v":""},0,0,0]
[null,null,{"$f":"IF(B236<>\"\",VLOOKUP(B236,'Tipo Projeto'!$A$3:$B$36,2,0),0)","v":0},null,null,null,null,null,null,null,null,"","","",0,0,0]
[null,null,{"$f":"IF(B237<>\"\",VLOOKUP(B237,'Tipo Projeto'!$A$3:$B$36,2,0),0)","v":0},null,null,null,null,null,null,null,null,"","","",0,0,0]
[null,null,{"$f":"IF(B238<>\"\",VLOOKUP(B238,'Tipo Projeto'!$A$3:$B$36,2,0),0)","v":0},null,null,null,null,null,null,null,null,"","","",0,0,0]
[null,null,{"$f":"IF(B239<>\"\",VLOOKUP(B239,'Tipo Projeto'!$A$3:$B$36,2,0),0)","v":0},null,null,null,null,null,null,null,null,"","","",0,0,0]
[null,null,{"$f":"IF(B240<>\"\",VLOOKUP(B240,'Tipo Projeto'!$A$3:$B$36,2,0),0)","v":0},null,null,null,null,null,null,null,null,"","","",0,0,0]
[null,null,{"$f":"IF(B241<>\"\",VLOOKUP(B241,'Tipo Projeto'!$A$3:$B$36,2,0),0)","v":0},null,null,null,null,null,null,null,null,"","","",0,0,0]
[null,null,{"$f":"IF(B242<>\"\",VLOOKUP(B242,'Tipo Projeto'!$A$3:$B$36,2,0),0)","v":0},null,null,null,null,null,null,null,null,"","","",0,0,0]
[null,null,{"$f":"IF(B243<>\"\",VLOOKUP(B243,'Tipo Projeto'!$A$3:$B$36,2,0),0)","v":0},null,null,null,null,null,null,null,null,"","","",0,0,0]
[null,null,{"$f":"IF(B244<>\"\",VLOOKUP(B244,'Tipo Projeto'!$A$3:$B$36,2,0),0)","v":0},null,null,null,null,null,null,null,null,"","","",0,0,0]
[null,null,{"$f":"IF(B245<>\"\",VLOOKUP(B245,'Tipo Projeto'!$A$3:$B$36,2,0),0)","v":0},null,null,null,null,null,null,null,null,"","","",0,0,0]
[null,null,{"$f":"IF(B246<>\"\",VLOOKUP(B246,'Tipo Projeto'!$A$3:$B$36,2,0),0)","v":0},null,null,null,null,null,null,null,null,"","","",0,0,0]
[null,null,{"$f":"IF(B247<>\"\",VLOOKUP(B247,'Tipo Projeto'!$A$3:$B$36,2,0),0)","v":0},null,null,null,null,null,null,null,null,"","","",0,0,0]
[null,null,{"$f":"IF(B248<>\"\",VLOOKUP(B248,'Tipo Projeto'!$A$3:$B$36,2,0),0)","v":0},null,null,null,null,null,null,null,null,"","","",0,0,0]
[null,null,{"$f":"IF(B249<>\"\",VLOOKUP(B249,'Tipo Projeto'!$A$3:$B$36,2,0),0)","v":0},null,null,null,null,null,null,null,null,"","","",0,0,0]
[null,null,{"$f":"IF(B250<>\"\",VLOOKUP(B250,'Tipo Projeto'!$A$3:$B$36,2,0),0)","v":0},null,null,null,null,null,null,null,null,"","","",0,0,0]
[null,null,{"$f":"IF(B251<>\"\",VLOOKUP(B251,'Tipo Projeto'!$A$3:$B$36,2,0),0)","v":0},null,null,null,null,null,null,null,null,"","","",0,0,0]
[null,null,{"$f":"IF(B252<>\"\",VLOOKUP(B252,'Tipo Projeto'!$A$3:$B$36,2,0),0)","v":0},null,null,null,null,null,null,null,null,"","","",0,0,0]
[null,null,{"$f":"IF(B253<>\"\",VLOOKUP(B253,'Tipo Projeto'!$A$3:$B$36,2,0),0)","v":0},null,null,null,null,null,null,null,null,"","","",0,0,0]
[null,null,{"$f":"IF(B254<>\"\",VLOOKUP(B254,'Tipo Projeto'!$A$3:$B$36,2,0),0)","v":0},null,null,null,null,null,null,null,null,"","","",0,0,0]
[null,null,{"$f":"IF(B255<>\"\",VLOOKUP(B255,'Tipo Projeto'!$A$3:$B$36,2,0),0)","v":0},null,null,null,null,null,null,null,null,"","","",0,0,0]
[null,null,{"$f":"IF(B256<>\"\",VLOOKUP(B256,'Tipo Projeto'!$A$3:$B$36,2,0),0)","v":0},null,null,null,null,null,null,null,null,"","","",0,0,0]
[null,null,{"$f":"IF(B257<>\"\",VLOOKUP(B257,'Tipo Projeto'!$A$3:$B$36,2,0),0)","v":0},null,null,null,null,null,null,null,null,"","","",0,0,0]
[null,null,{"$f":"IF(B258<>\"\",VLOOKUP(B258,'Tipo Projeto'!$A$3:$B$36,2,0),0)","v":0},null,null,null,null,null,null,null,null,"","","",0,0,0]
[null,null,{"$f":"IF(B259<>\"\",VLOOKUP(B259,'Tipo Projeto'!$A$3:$B$36,2,0),0)","v":0},null,null,null,null,null,null,null,null,"","","",0,0,0]
[null,null,{"$f":"IF(B260<>\"\",VLOOKUP(B260,'Tipo Projeto'!$A$3:$B$36,2,0),0)","v":0},null,null,null,null,null,null,null,null,"","","",0,0,0]
[null,null,{"$f":"IF(B261<>\"\",VLOOKUP(B261,'Tipo Projeto'!$A$3:$B$36,2,0),0)","v":0},null,null,null,null,null,null,null,null,"","","",0,0,0]
[null,null,{"$f":"IF(B262<>\"\",VLOOKUP(B262,'Tipo Projeto'!$A$3:$B$36,2,0),0)","v":0},null,null,null,null,null,null,null,null,"","","",0,0,0]
[null,null,{"$f":"IF(B263<>\"\",VLOOKUP(B263,'Tipo Projeto'!$A$3:$B$36,2,0),0)","v":0},null,null,null,null,null,null,null,null,"","","",0,0,0]
[null,null,{"$f":"IF(B264<>\"\",VLOOKUP(B264,'Tipo Projeto'!$A$3:$B$36,2,0),0)","v":0},null,null,null,null,null,null,null,null,"","","",0,0,0]
[null,null,{"$f":"IF(B265<>\"\",VLOOKUP(B265,'Tipo Projeto'!$A$3:$B$36,2,0),0)","v":0},null,null,null,null,null,null,null,null,"","","",0,0,0]
[null,null,{"$f":"IF(B266<>\"\",VLOOKUP(B266,'Tipo Projeto'!$A$3:$B$36,2,0),0)","v":0},null,null,null,null,null,null,null,null,"","","",0,0,0]
[null,null,{"$f":"IF(B267<>\"\",VLOOKUP(B267,'Tipo Projeto'!$A$3:$B$36,2,0),0)","v":0},null,null,null,null,null,null,null,null,"","","",0,0,{"$f":"IF(B267<>\"Manutenção em interface\",IF(B267<>\"Desenv., Manutenção e Publicação de Páginas Estáticas\",(O267+P267)*C267,C267),C267)","v":0}]
[null,null,{"$f":"IF(B268<>\"\",VLOOKUP(B268,'Tipo Projeto'!$A$3:$B$36,2,0),0)","v":0},null,null,null,null,null,null,null,null,"","","",0,0,0]
[null,null,{"$f":"IF(B269<>\"\",VLOOKUP(B269,'Tipo Projeto'!$A$3:$B$36,2,0),0)","v":0},null,null,null,null,null,null,null,null,"","","",0,0,0]
[null,null,{"$f":"IF(B270<>\"\",VLOOKUP(B270,'Tipo Projeto'!$A$3:$B$36,2,0),0)","v":0},null,null,null,null,null,null,null,null,"","","",0,0,0]
[null,null,{"$f":"IF(B271<>\"\",VLOOKUP(B271,'Tipo Projeto'!$A$3:$B$36,2,0),0)","v":0},null,null,null,null,null,null,null,null,"","","",0,0,0]
[null,null,{"$f":"IF(B272<>\"\",VLOOKUP(B272,'Tipo Projeto'!$A$3:$B$36,2,0),0)","v":0},null,null,null,null,null,null,null,null,"","","",0,0,0]
[null,null,{"$f":"IF(B273<>\"\",VLOOKUP(B273,'Tipo Projeto'!$A$3:$B$36,2,0),0)","v":0},null,null,null,null,null,null,null,null,"","","",0,0,0]
[null,null,{"$f":"IF(B274<>\"\",VLOOKUP(B274,'Tipo Projeto'!$A$3:$B$36,2,0),0)","v":0},null,null,null,null,null,null,null,null,"","","",0,0,0]
[null,null,{"$f":"IF(B275<>\"\",VLOOKUP(B275,'Tipo Projeto'!$A$3:$B$36,2,0),0)","v":0},null,null,null,null,null,null,null,null,"","","",0,0,0]
[null,null,{"$f":"IF(B276<>\"\",VLOOKUP(B276,'Tipo Projeto'!$A$3:$B$36,2,0),0)","v":0},null,null,null,null,null,null,null,null,"","","",0,0,0]
[null,null,{"$f":"IF(B277<>\"\",VLOOKUP(B277,'Tipo Projeto'!$A$3:$B$36,2,0),0)","v":0},null,null,null,null,null,null,null,null,"","","",0,0,0]
[null,null,{"$f":"IF(B278<>\"\",VLOOKUP(B278,'Tipo Projeto'!$A$3:$B$36,2,0),0)","v":0},null,null,null,null,null,null,null,null,"","","",0,0,0]
[null,null,{"$f":"IF(B279<>\"\",VLOOKUP(B279,'Tipo Projeto'!$A$3:$B$36,2,0),0)","v":0},null,null,null,null,null,null,null,null,"","","",0,0,0]
[null,null,{"$f":"IF(B280<>\"\",VLOOKUP(B280,'Tipo Projeto'!$A$3:$B$36,2,0),0)","v":0},null,null,null,null,null,null,null,null,"","","",0,0,0]
[null,null,{"$f":"IF(B281<>\"\",VLOOKUP(B281,'Tipo Projeto'!$A$3:$B$36,2,0),0)","v":0},null,null,null,null,null,null,null,null,"","","",0,0,0]
[null,null,{"$f":"IF(B282<>\"\",VLOOKUP(B282,'Tipo Projeto'!$A$3:$B$36,2,0),0)","v":0},null,null,null,null,null,null,null,null,"","","",0,0,0]
[null,null,{"$f":"IF(B283<>\"\",VLOOKUP(B283,'Tipo Projeto'!$A$3:$B$36,2,0),0)","v":0},null,null,null,null,null,null,null,null,"","","",0,0,0]
[null,null,{"$f":"IF(B284<>\"\",VLOOKUP(B284,'Tipo Projeto'!$A$3:$B$36,2,0),0)","v":0},null,null,null,null,null,null,null,null,"","","",0,0,0]
[null,null,{"$f":"IF(B285<>\"\",VLOOKUP(B285,'Tipo Projeto'!$A$3:$B$36,2,0),0)","v":0},null,null,null,null,null,null,null,null,"","","",0,0,0]
[null,null,{"$f":"IF(B286<>\"\",VLOOKUP(B286,'Tipo Projeto'!$A$3:$B$36,2,0),0)","v":0},null,null,null,null,null,null,null,null,"","","",0,0,0]
[null,null,{"$f":"IF(B287<>\"\",VLOOKUP(B287,'Tipo Projeto'!$A$3:$B$36,2,0),0)","v":0},null,null,null,null,null,null,null,null,"","","",0,0,0]
[null,null,{"$f":"IF(B288<>\"\",VLOOKUP(B288,'Tipo Projeto'!$A$3:$B$36,2,0),0)","v":0},null,null,null,null,null,null,null,null,"","","",0,0,0]
[null,null,{"$f":"IF(B289<>\"\",VLOOKUP(B289,'Tipo Projeto'!$A$3:$B$36,2,0),0)","v":0},null,null,null,null,null,null,null,null,"","","",0,0,0]
[null,null,{"$f":"IF(B290<>\"\",VLOOKUP(B290,'Tipo Projeto'!$A$3:$B$36,2,0),0)","v":0},null,null,null,null,null,null,null,null,"","","",0,0,0]
[null,null,{"$f":"IF(B291<>\"\",VLOOKUP(B291,'Tipo Projeto'!$A$3:$B$36,2,0),0)","v":0},null,null,null,null,null,null,null,null,"","","",0,0,0]
[null,null,{"$f":"IF(B292<>\"\",VLOOKUP(B292,'Tipo Projeto'!$A$3:$B$36,2,0),0)","v":0},null,null,null,null,null,null,null,null,"","","",0,0,0]
[null,null,{"$f":"IF(B293<>\"\",VLOOKUP(B293,'Tipo Projeto'!$A$3:$B$36,2,0),0)","v":0},null,null,null,null,null,null,null,null,"","","",0,0,0]
[null,null,{"$f":"IF(B294<>\"\",VLOOKUP(B294,'Tipo Projeto'!$A$3:$B$36,2,0),0)","v":0},null,null,null,null,null,null,null,null,"","","",0,0,0]
[null,null,{"$f":"IF(B295<>\"\",VLOOKUP(B295,'Tipo Projeto'!$A$3:$B$36,2,0),0)","v":0},null,null,null,null,null,null,null,null,"","","",0,0,0]
[null,null,{"$f":"IF(B296<>\"\",VLOOKUP(B296,'Tipo Projeto'!$A$3:$B$36,2,0),0)","v":0},null,null,null,null,null,null,null,null,"","","",0,0,0]
[null,null,{"$f":"IF(B297<>\"\",VLOOKUP(B297,'Tipo Projeto'!$A$3:$B$36,2,0),0)","v":0},null,null,null,null,null,null,null,null,"","","",0,0,0]
[null,null,{"$f":"IF(B298<>\"\",VLOOKUP(B298,'Tipo Projeto'!$A$3:$B$36,2,0),0)","v":0},null,null,null,null,null,null,null,null,{"$f":"IF(K298=\"EE\",IF(OR(AND(OR(J298=1,J298=0),I298>0,I298<5),AND(OR(J298=1,J298=0),I298>4,I298<16),AND(J298=2,I298>0,I298<5)),\"Simples\",IF(OR(AND(OR(J298=1,J298=0),I298>15),AND(J298=2,I298>4,I298<16),AND(J298>2,I298>0,I298<5)),\"Médio\",IF(OR(AND(J298=2,I298>15),AND(J298>2,I298>4,I298<16),AND(J298>2,I298>15)),\"Complexo\",\"\"))),\nIF(OR(K298=\"CE\",K298=\"SE\"),IF(OR(AND(OR(J298=1,J298=0),I298>0,I298<6),AND(OR(J298=1,J298=0),I298>5,I298<20),AND(J298>1,J298<4,I298>0,I298<6)),\"Simples\",IF(OR(AND(OR(J298=1,J298=0),I298>19),AND(J298>1,J298<4,I298>5,I298<20),AND(J298>3,I298>0,I298<6)),\"Médio\",IF(OR(AND(J298>1,J298<4,I298>19),AND(J298>3,I298>5,I298<20),AND(J298>3,I298>19)),\"Complexo\",\"\"))),\"\"))","v":""},{"$f":"IF(K298=\"ALI\",IF(OR(AND(OR(J298=1,J298=0),I298>0,I298<20),AND(OR(J298=1,J298=0),I298>19,I298<51),AND(J298>1,J298<6,I298>0,I298<20)),\"Simples\",IF(OR(AND(OR(J298=1,J298=0),I298>50),AND(J298>1,J298<6,I298>19,I298<51),AND(J298>5,I298>0,I298<20)),\"Médio\",IF(OR(AND(J298>1,J298<6,I298>50),AND(J298>5,I298>19,I298<51),AND(J298>5,I298>50)),\"Complexo\",\"\"))),\nIF(K298=\"AIE\",IF(OR(AND(OR(J298=1, J298=0),I298>0,I298<20),AND(OR(J298=1, J298=0),I298>19,I298<51),AND(J298>1,J298<6,I298>0,I298<20)),\"Simples\",IF(OR(AND(OR(J298=1, J298=0),I298>50),AND(J298>1,J298<6,I298>19,I298<51),AND(J298>5,I298>0,I298<20)),\"Médio\",IF(OR(AND(J298>1,J298<6,I298>50),AND(J298>5,I298>19,I298<51),AND(J298>5,I298>50)),\"Complexo\",\"\"))),\"\"))","v":""},"",{"$f":"IF(AND(OR(K298=\"EE\",K298=\"CE\"),N298=\"Simples\"),3,\nIF(AND(OR(K298=\"EE\",K298=\"CE\"),N298=\"Médio\"),4,\nIF(AND(OR(K298=\"EE\",K298=\"CE\"),N298=\"Complexo\"),6,\nIF(AND(K298=\"SE\",N298=\"Simples\"),4,\nIF(AND(K298=\"SE\",N298=\"Médio\"),5,\nIF(AND(K298=\"SE\",N298=\"Complexo\"),7,0))))))","v":0},{"$f":"IF(AND(K298=\"ALI\",M298=\"Simples\"),7,\nIF(AND(K298=\"ALI\",M298=\"Médio\"),10,\nIF(AND(K298=\"ALI\",M298=\"Complexo\"),15,\nIF(AND(K298=\"AIE\",M298=\"Simples\"),5,\nIF(AND(K298=\"AIE\",M298=\"Médio\"),7,\nIF(AND(K298=\"AIE\",M298=\"Complexo\"),10,0))))))","v":0},0]
[null,null,{"$f":"IF(B299<>\"\",VLOOKUP(B299,'Tipo Projeto'!$A$3:$B$36,2,0),0)","v":0},null,null,null,null,null,null,null,null,"","",{"$f":"IF(L299=\"\",M299,IF(M299=\"\",L299,\"\"))","v":""},0,0,0]
[null,null,{"$f":"IF(B300<>\"\",VLOOKUP(B300,'Tipo Projeto'!$A$3:$B$36,2,0),0)","v":0},null,null,null,null,null,null,null,null,"","","",0,0,0]
[null,null,{"$f":"IF(B301<>\"\",VLOOKUP(B301,'Tipo Projeto'!$A$3:$B$36,2,0),0)","v":0},null,null,null,null,null,null,null,null,"","","",0,0,0]
[null,null,{"$f":"IF(B302<>\"\",VLOOKUP(B302,'Tipo Projeto'!$A$3:$B$36,2,0),0)","v":0},null,null,null,null,null,null,null,null,"","","",0,0,0]
[null,null,{"$f":"IF(B303<>\"\",VLOOKUP(B303,'Tipo Projeto'!$A$3:$B$36,2,0),0)","v":0},null,null,null,null,null,null,null,null,"","","",0,0,0]
[null,null,{"$f":"IF(B304<>\"\",VLOOKUP(B304,'Tipo Projeto'!$A$3:$B$36,2,0),0)","v":0},null,null,null,null,null,null,null,null,"","","",0,0,0]
[null,null,{"$f":"IF(B305<>\"\",VLOOKUP(B305,'Tipo Projeto'!$A$3:$B$36,2,0),0)","v":0},null,null,null,null,null,null,null,null,"","","",0,0,0]
[null,null,{"$f":"IF(B306<>\"\",VLOOKUP(B306,'Tipo Projeto'!$A$3:$B$36,2,0),0)","v":0},null,null,null,null,null,null,null,null,"","","",0,0,0]
[null,null,{"$f":"IF(B307<>\"\",VLOOKUP(B307,'Tipo Projeto'!$A$3:$B$36,2,0),0)","v":0},null,null,null,null,null,null,null,null,"","","",0,0,0]
[null,null,{"$f":"IF(B308<>\"\",VLOOKUP(B308,'Tipo Projeto'!$A$3:$B$36,2,0),0)","v":0},null,null,null,null,null,null,null,null,"","","",0,0,0]
[null,null,{"$f":"IF(B309<>\"\",VLOOKUP(B309,'Tipo Projeto'!$A$3:$B$36,2,0),0)","v":0},null,null,null,null,null,null,null,null,"","","",0,0,0]
[null,null,{"$f":"IF(B310<>\"\",VLOOKUP(B310,'Tipo Projeto'!$A$3:$B$36,2,0),0)","v":0},null,null,null,null,null,null,null,null,"","","",0,0,0]
[null,null,{"$f":"IF(B311<>\"\",VLOOKUP(B311,'Tipo Projeto'!$A$3:$B$36,2,0),0)","v":0},null,null,null,null,null,null,null,null,"","","",0,0,0]
[null,null,{"$f":"IF(B312<>\"\",VLOOKUP(B312,'Tipo Projeto'!$A$3:$B$36,2,0),0)","v":0},null,null,null,null,null,null,null,null,"","","",0,0,0]
[null,null,{"$f":"IF(B313<>\"\",VLOOKUP(B313,'Tipo Projeto'!$A$3:$B$36,2,0),0)","v":0},null,null,null,null,null,null,null,null,"","","",0,0,0]
[null,null,{"$f":"IF(B314<>\"\",VLOOKUP(B314,'Tipo Projeto'!$A$3:$B$36,2,0),0)","v":0},null,null,null,null,null,null,null,null,"","","",0,0,0]
[null,null,{"$f":"IF(B315<>\"\",VLOOKUP(B315,'Tipo Projeto'!$A$3:$B$36,2,0),0)","v":0},null,null,null,null,null,null,null,null,"","","",0,0,0]
[null,null,{"$f":"IF(B316<>\"\",VLOOKUP(B316,'Tipo Projeto'!$A$3:$B$36,2,0),0)","v":0},null,null,null,null,null,null,null,null,"","","",0,0,0]
[null,null,{"$f":"IF(B317<>\"\",VLOOKUP(B317,'Tipo Projeto'!$A$3:$B$36,2,0),0)","v":0},null,null,null,null,null,null,null,null,"","","",0,0,0]
[null,null,{"$f":"IF(B318<>\"\",VLOOKUP(B318,'Tipo Projeto'!$A$3:$B$36,2,0),0)","v":0},null,null,null,null,null,null,null,null,"","","",0,0,0]
[null,null,{"$f":"IF(B319<>\"\",VLOOKUP(B319,'Tipo Projeto'!$A$3:$B$36,2,0),0)","v":0},null,null,null,null,null,null,null,null,"","","",0,0,0]
[null,null,{"$f":"IF(B320<>\"\",VLOOKUP(B320,'Tipo Projeto'!$A$3:$B$36,2,0),0)","v":0},null,null,null,null,null,null,null,null,"","","",0,0,0]
[null,null,{"$f":"IF(B321<>\"\",VLOOKUP(B321,'Tipo Projeto'!$A$3:$B$36,2,0),0)","v":0},null,null,null,null,null,null,null,null,"","","",0,0,0]
[null,null,{"$f":"IF(B322<>\"\",VLOOKUP(B322,'Tipo Projeto'!$A$3:$B$36,2,0),0)","v":0},null,null,null,null,null,null,null,null,"","","",0,0,0]
[null,null,{"$f":"IF(B323<>\"\",VLOOKUP(B323,'Tipo Projeto'!$A$3:$B$36,2,0),0)","v":0},null,null,null,null,null,null,null,null,"","","",0,0,0]
[null,null,{"$f":"IF(B324<>\"\",VLOOKUP(B324,'Tipo Projeto'!$A$3:$B$36,2,0),0)","v":0},null,null,null,null,null,null,null,null,"","","",0,0,0]
[null,null,{"$f":"IF(B325<>\"\",VLOOKUP(B325,'Tipo Projeto'!$A$3:$B$36,2,0),0)","v":0},null,null,null,null,null,null,null,null,"","","",0,0,0]
[null,null,{"$f":"IF(B326<>\"\",VLOOKUP(B326,'Tipo Projeto'!$A$3:$B$36,2,0),0)","v":0},null,null,null,null,null,null,null,null,"","","",0,0,0]
[null,null,{"$f":"IF(B327<>\"\",VLOOKUP(B327,'Tipo Projeto'!$A$3:$B$36,2,0),0)","v":0},null,null,null,null,null,null,null,null,"","","",0,0,0]
[null,null,{"$f":"IF(B328<>\"\",VLOOKUP(B328,'Tipo Projeto'!$A$3:$B$36,2,0),0)","v":0},null,null,null,null,null,null,null,null,"","","",0,0,0]
[null,null,{"$f":"IF(B329<>\"\",VLOOKUP(B329,'Tipo Projeto'!$A$3:$B$36,2,0),0)","v":0},null,null,null,null,null,null,null,null,"","","",0,0,0]
[null,null,{"$f":"IF(B330<>\"\",VLOOKUP(B330,'Tipo Projeto'!$A$3:$B$36,2,0),0)","v":0},null,null,null,null,null,null,null,null,"","","",0,0,0]
[null,null,{"$f":"IF(B331<>\"\",VLOOKUP(B331,'Tipo Projeto'!$A$3:$B$36,2,0),0)","v":0},null,null,null,null,null,null,null,null,"","","",0,0,{"$f":"IF(B331<>\"Manutenção em interface\",IF(B331<>\"Desenv., Manutenção e Publicação de Páginas Estáticas\",(O331+P331)*C331,C331),C331)","v":0}]
[null,null,{"$f":"IF(B332<>\"\",VLOOKUP(B332,'Tipo Projeto'!$A$3:$B$36,2,0),0)","v":0},null,null,null,null,null,null,null,null,"","","",0,0,0]
[null,null,{"$f":"IF(B333<>\"\",VLOOKUP(B333,'Tipo Projeto'!$A$3:$B$36,2,0),0)","v":0},null,null,null,null,null,null,null,null,"","","",0,0,0]
[null,null,{"$f":"IF(B334<>\"\",VLOOKUP(B334,'Tipo Projeto'!$A$3:$B$36,2,0),0)","v":0},null,null,null,null,null,null,null,null,"","","",0,0,0]
[null,null,{"$f":"IF(B335<>\"\",VLOOKUP(B335,'Tipo Projeto'!$A$3:$B$36,2,0),0)","v":0},null,null,null,null,null,null,null,null,"","","",0,0,0]
[null,null,{"$f":"IF(B336<>\"\",VLOOKUP(B336,'Tipo Projeto'!$A$3:$B$36,2,0),0)","v":0},null,null,null,null,null,null,null,null,"","","",0,0,0]
[null,null,{"$f":"IF(B337<>\"\",VLOOKUP(B337,'Tipo Projeto'!$A$3:$B$36,2,0),0)","v":0},null,null,null,null,null,null,null,null,"","","",0,0,0]
[null,null,{"$f":"IF(B338<>\"\",VLOOKUP(B338,'Tipo Projeto'!$A$3:$B$36,2,0),0)","v":0},null,null,null,null,null,null,null,null,"","","",0,0,0]
[null,null,{"$f":"IF(B339<>\"\",VLOOKUP(B339,'Tipo Projeto'!$A$3:$B$36,2,0),0)","v":0},null,null,null,null,null,null,null,null,"","","",0,0,0]
[null,null,{"$f":"IF(B340<>\"\",VLOOKUP(B340,'Tipo Projeto'!$A$3:$B$36,2,0),0)","v":0},null,null,null,null,null,null,null,null,"","","",0,0,0]
[null,null,{"$f":"IF(B341<>\"\",VLOOKUP(B341,'Tipo Projeto'!$A$3:$B$36,2,0),0)","v":0},null,null,null,null,null,null,null,null,"","","",0,0,0]
[null,null,{"$f":"IF(B342<>\"\",VLOOKUP(B342,'Tipo Projeto'!$A$3:$B$36,2,0),0)","v":0},null,null,null,null,null,null,null,null,"","","",0,0,0]
[null,null,{"$f":"IF(B343<>\"\",VLOOKUP(B343,'Tipo Projeto'!$A$3:$B$36,2,0),0)","v":0},null,null,null,null,null,null,null,null,"","","",0,0,0]
[null,null,{"$f":"IF(B344<>\"\",VLOOKUP(B344,'Tipo Projeto'!$A$3:$B$36,2,0),0)","v":0},null,null,null,null,null,null,null,null,"","","",0,0,0]
[null,null,{"$f":"IF(B345<>\"\",VLOOKUP(B345,'Tipo Projeto'!$A$3:$B$36,2,0),0)","v":0},null,null,null,null,null,null,null,null,"","","",0,0,0]
[null,null,{"$f":"IF(B346<>\"\",VLOOKUP(B346,'Tipo Projeto'!$A$3:$B$36,2,0),0)","v":0},null,null,null,null,null,null,null,null,"","","",0,0,0]
[null,null,{"$f":"IF(B347<>\"\",VLOOKUP(B347,'Tipo Projeto'!$A$3:$B$36,2,0),0)","v":0},null,null,null,null,null,null,null,null,"","","",0,0,0]
[null,null,{"$f":"IF(B348<>\"\",VLOOKUP(B348,'Tipo Projeto'!$A$3:$B$36,2,0),0)","v":0},null,null,null,null,null,null,null,null,"","","",0,0,0]
[null,null,{"$f":"IF(B349<>\"\",VLOOKUP(B349,'Tipo Projeto'!$A$3:$B$36,2,0),0)","v":0},null,null,null,null,null,null,null,null,"","","",0,0,0]
[null,null,{"$f":"IF(B350<>\"\",VLOOKUP(B350,'Tipo Projeto'!$A$3:$B$36,2,0),0)","v":0},null,null,null,null,null,null,null,null,"","","",0,0,0]
[null,null,{"$f":"IF(B351<>\"\",VLOOKUP(B351,'Tipo Projeto'!$A$3:$B$36,2,0),0)","v":0},null,null,null,null,null,null,null,null,"","","",0,0,0]
[null,null,{"$f":"IF(B352<>\"\",VLOOKUP(B352,'Tipo Projeto'!$A$3:$B$36,2,0),0)","v":0},null,null,null,null,null,null,null,null,"","","",0,0,0]
[null,null,{"$f":"IF(B353<>\"\",VLOOKUP(B353,'Tipo Projeto'!$A$3:$B$36,2,0),0)","v":0},null,null,null,null,null,null,null,null,"","","",0,0,0]
[null,null,{"$f":"IF(B354<>\"\",VLOOKUP(B354,'Tipo Projeto'!$A$3:$B$36,2,0),0)","v":0},null,null,null,null,null,null,null,null,"","","",0,0,0]
[null,null,{"$f":"IF(B355<>\"\",VLOOKUP(B355,'Tipo Projeto'!$A$3:$B$36,2,0),0)","v":0},null,null,null,null,null,null,null,null,"","","",0,0,0]
[null,null,{"$f":"IF(B356<>\"\",VLOOKUP(B356,'Tipo Projeto'!$A$3:$B$36,2,0),0)","v":0},null,null,null,null,null,null,null,null,"","","",0,0,0]
[null,null,{"$f":"IF(B357<>\"\",VLOOKUP(B357,'Tipo Projeto'!$A$3:$B$36,2,0),0)","v":0},null,null,null,null,null,null,null,null,"","","",0,0,0]
[null,null,{"$f":"IF(B358<>\"\",VLOOKUP(B358,'Tipo Projeto'!$A$3:$B$36,2,0),0)","v":0},null,null,null,null,null,null,null,null,"","","",0,0,0]
[null,null,{"$f":"IF(B359<>\"\",VLOOKUP(B359,'Tipo Projeto'!$A$3:$B$36,2,0),0)","v":0},null,null,null,null,null,null,null,null,"","","",0,0,0]
[null,null,{"$f":"IF(B360<>\"\",VLOOKUP(B360,'Tipo Projeto'!$A$3:$B$36,2,0),0)","v":0},null,null,null,null,null,null,null,null,"","","",0,0,0]
[null,null,{"$f":"IF(B361<>\"\",VLOOKUP(B361,'Tipo Projeto'!$A$3:$B$36,2,0),0)","v":0},null,null,null,null,null,null,null,null,"","","",0,0,0]
[null,null,{"$f":"IF(B362<>\"\",VLOOKUP(B362,'Tipo Projeto'!$A$3:$B$36,2,0),0)","v":0},null,null,null,null,null,null,null,null,{"$f":"IF(K362=\"EE\",IF(OR(AND(OR(J362=1,J362=0),I362>0,I362<5),AND(OR(J362=1,J362=0),I362>4,I362<16),AND(J362=2,I362>0,I362<5)),\"Simples\",IF(OR(AND(OR(J362=1,J362=0),I362>15),AND(J362=2,I362>4,I362<16),AND(J362>2,I362>0,I362<5)),\"Médio\",IF(OR(AND(J362=2,I362>15),AND(J362>2,I362>4,I362<16),AND(J362>2,I362>15)),\"Complexo\",\"\"))),\nIF(OR(K362=\"CE\",K362=\"SE\"),IF(OR(AND(OR(J362=1,J362=0),I362>0,I362<6),AND(OR(J362=1,J362=0),I362>5,I362<20),AND(J362>1,J362<4,I362>0,I362<6)),\"Simples\",IF(OR(AND(OR(J362=1,J362=0),I362>19),AND(J362>1,J362<4,I362>5,I362<20),AND(J362>3,I362>0,I362<6)),\"Médio\",IF(OR(AND(J362>1,J362<4,I362>19),AND(J362>3,I362>5,I362<20),AND(J362>3,I362>19)),\"Complexo\",\"\"))),\"\"))","v":""},{"$f":"IF(K362=\"ALI\",IF(OR(AND(OR(J362=1,J362=0),I362>0,I362<20),AND(OR(J362=1,J362=0),I362>19,I362<51),AND(J362>1,J362<6,I362>0,I362<20)),\"Simples\",IF(OR(AND(OR(J362=1,J362=0),I362>50),AND(J362>1,J362<6,I362>19,I362<51),AND(J362>5,I362>0,I362<20)),\"Médio\",IF(OR(AND(J362>1,J362<6,I362>50),AND(J362>5,I362>19,I362<51),AND(J362>5,I362>50)),\"Complexo\",\"\"))),\nIF(K362=\"AIE\",IF(OR(AND(OR(J362=1, J362=0),I362>0,I362<20),AND(OR(J362=1, J362=0),I362>19,I362<51),AND(J362>1,J362<6,I362>0,I362<20)),\"Simples\",IF(OR(AND(OR(J362=1, J362=0),I362>50),AND(J362>1,J362<6,I362>19,I362<51),AND(J362>5,I362>0,I362<20)),\"Médio\",IF(OR(AND(J362>1,J362<6,I362>50),AND(J362>5,I362>19,I362<51),AND(J362>5,I362>50)),\"Complexo\",\"\"))),\"\"))","v":""},"",{"$f":"IF(AND(OR(K362=\"EE\",K362=\"CE\"),N362=\"Simples\"),3,\nIF(AND(OR(K362=\"EE\",K362=\"CE\"),N362=\"Médio\"),4,\nIF(AND(OR(K362=\"EE\",K362=\"CE\"),N362=\"Complexo\"),6,\nIF(AND(K362=\"SE\",N362=\"Simples\"),4,\nIF(AND(K362=\"SE\",N362=\"Médio\"),5,\nIF(AND(K362=\"SE\",N362=\"Complexo\"),7,0))))))","v":0},{"$f":"IF(AND(K362=\"ALI\",M362=\"Simples\"),7,\nIF(AND(K362=\"ALI\",M362=\"Médio\"),10,\nIF(AND(K362=\"ALI\",M362=\"Complexo\"),15,\nIF(AND(K362=\"AIE\",M362=\"Simples\"),5,\nIF(AND(K362=\"AIE\",M362=\"Médio\"),7,\nIF(AND(K362=\"AIE\",M362=\"Complexo\"),10,0))))))","v":0},0]
[null,null,{"$f":"IF(B363<>\"\",VLOOKUP(B363,'Tipo Projeto'!$A$3:$B$36,2,0),0)","v":0},null,null,null,null,null,null,null,null,"","",{"$f":"IF(L363=\"\",M363,IF(M363=\"\",L363,\"\"))","v":""},0,0,0]
[null,null,{"$f":"IF(B364<>\"\",VLOOKUP(B364,'Tipo Projeto'!$A$3:$B$36,2,0),0)","v":0},null,null,null,null,null,null,null,null,"","","",0,0,0]
[null,null,{"$f":"IF(B365<>\"\",VLOOKUP(B365,'Tipo Projeto'!$A$3:$B$36,2,0),0)","v":0},null,null,null,null,null,null,null,null,"","","",0,0,0]
[null,null,{"$f":"IF(B366<>\"\",VLOOKUP(B366,'Tipo Projeto'!$A$3:$B$36,2,0),0)","v":0},null,null,null,null,null,null,null,null,"","","",0,0,0]
[null,null,{"$f":"IF(B367<>\"\",VLOOKUP(B367,'Tipo Projeto'!$A$3:$B$36,2,0),0)","v":0},null,null,null,null,null,null,null,null,"","","",0,0,0]
[null,null,{"$f":"IF(B368<>\"\",VLOOKUP(B368,'Tipo Projeto'!$A$3:$B$36,2,0),0)","v":0},null,null,null,null,null,null,null,null,"","","",0,0,0]
[null,null,{"$f":"IF(B369<>\"\",VLOOKUP(B369,'Tipo Projeto'!$A$3:$B$36,2,0),0)","v":0},null,null,null,null,null,null,null,null,"","","",0,0,0]
[null,null,{"$f":"IF(B370<>\"\",VLOOKUP(B370,'Tipo Projeto'!$A$3:$B$36,2,0),0)","v":0},null,null,null,null,null,null,null,null,"","","",0,0,0]
[null,null,{"$f":"IF(B371<>\"\",VLOOKUP(B371,'Tipo Projeto'!$A$3:$B$36,2,0),0)","v":0},null,null,null,null,null,null,null,null,"","","",0,0,0]
[null,null,{"$f":"IF(B372<>\"\",VLOOKUP(B372,'Tipo Projeto'!$A$3:$B$36,2,0),0)","v":0},null,null,null,null,null,null,null,null,"","","",0,0,0]
[null,null,{"$f":"IF(B373<>\"\",VLOOKUP(B373,'Tipo Projeto'!$A$3:$B$36,2,0),0)","v":0},null,null,null,null,null,null,null,null,"","","",0,0,0]
[null,null,{"$f":"IF(B374<>\"\",VLOOKUP(B374,'Tipo Projeto'!$A$3:$B$36,2,0),0)","v":0},null,null,null,null,null,null,null,null,"","","",0,0,0]
[null,null,{"$f":"IF(B375<>\"\",VLOOKUP(B375,'Tipo Projeto'!$A$3:$B$36,2,0),0)","v":0},null,null,null,null,null,null,null,null,"","","",0,0,0]
[null,null,{"$f":"IF(B376<>\"\",VLOOKUP(B376,'Tipo Projeto'!$A$3:$B$36,2,0),0)","v":0},null,null,null,null,null,null,null,null,"","","",0,0,0]
[null,null,{"$f":"IF(B377<>\"\",VLOOKUP(B377,'Tipo Projeto'!$A$3:$B$36,2,0),0)","v":0},null,null,null,null,null,null,null,null,"","","",0,0,0]
[null,null,{"$f":"IF(B378<>\"\",VLOOKUP(B378,'Tipo Projeto'!$A$3:$B$36,2,0),0)","v":0},null,null,null,null,null,null,null,null,"","","",0,0,0]
[null,null,{"$f":"IF(B379<>\"\",VLOOKUP(B379,'Tipo Projeto'!$A$3:$B$36,2,0),0)","v":0},null,null,null,null,null,null,null,null,"","","",0,0,0]
[null,null,{"$f":"IF(B380<>\"\",VLOOKUP(B380,'Tipo Projeto'!$A$3:$B$36,2,0),0)","v":0},null,null,null,null,null,null,null,null,"","","",0,0,0]
[null,null,{"$f":"IF(B381<>\"\",VLOOKUP(B381,'Tipo Projeto'!$A$3:$B$36,2,0),0)","v":0},null,null,null,null,null,null,null,null,"","","",0,0,0]
[null,null,{"$f":"IF(B382<>\"\",VLOOKUP(B382,'Tipo Projeto'!$A$3:$B$36,2,0),0)","v":0},null,null,null,null,null,null,null,null,"","","",0,0,0]
[null,null,{"$f":"IF(B383<>\"\",VLOOKUP(B383,'Tipo Projeto'!$A$3:$B$36,2,0),0)","v":0},null,null,null,null,null,null,null,null,"","","",0,0,0]
["Só inserir linhas antes desta."]
[null,null,null,null,null,null,null,null,null,null,null,null,null,"Tamanho Funcional",null,0,{"$f":"SUM(Q10:Q384)","v":0}]

{"sheet":"AFP - Estimativa","index":3,"n_rows":384,"n_cols":11,"rows_kept":384,"cut":false,"hidden":false,"merged":[[0,2,0,10],[4,0,5,1],[4,2,5,3],[2,8,2,10],[4,8,4,10],[5,8,5,10],[1,0,1,1],[7,10,8,10],[3,8,3,10],[383,7,383,8],[7,1,8,1],[7,2,8,2],[7,7,8,7],[7,8,7,9],[9,0,9,10],[382,0,382,10],[7,0,8,0],[7,3,8,3],[7,4,8,4],[7,5,8,5],[7,6,8,6]]}
[{"$f":"Resumo!A1","v":"Template V.1.6"},null,"Contagem de Pontos de Função - SISP 2.0\nContagem Estimada"]
[]
[null,null,null,null,null,null,null,"Elaborador da contagem:"]
[null,null,null,null,null,null,null,"Data da Contagem:"]
["Quantidade de Pontos de Função:",null,{"$f":"TEXT(J384,\"#.##0,0#\")","v":"0,0"},null,null,null,null,"Revisor da contagem:"]
[null,null,null,null,null,null,null,"Data da Revisão:"]
[]
["ID","Tipo Projeto","Fator Ajuste","Item PT","Release","Módulo","Requisito","Processos elementares","Desenvolvimento",null,"Fund."]
[null,null,null,null,null,null,null,null,"Tipo","PF"]
["Só inserir linhas depois desta."]
[null,null,{"$f":"IF(B11<>\"\",VLOOKUP(B11,'Tipo Projeto'!$A$3:$B$36,2,0),0)","v":0},null,null,null,null,null,null,{"$f":"IF(B11<>\"Manutenção em interface\",IF(B11<>\"Desenv., Manutenção e Publicação de Páginas Estáticas\",IF(I11=\"EE\",4,IF(I11=\"CE\",4,IF(I11=\"SE\",5,IF(I11=\"ALI\",7,IF(I11=\"AIE\",5,0)))))*C11,C11),C11)","v":0}]
[null,null,{"$f":"IF(B12<>\"\",VLOOKUP(B12,'Tipo Projeto'!$A$3:$B$36,2,0),0)","v":0},null,null,null,null,null,null,0]
[null,null,{"$f":"IF(B13<>\"\",VLOOKUP(B13,'Tipo Projeto'!$A$3:$B$36,2,0),0)","v":0},null,null,null,null,null,null,0]
[null,null,{"$f":"IF(B14<>\"\",VLOOKUP(B14,'Tipo Projeto'!$A$3:$B$36,2,0),0)","v":0},null,null,null,null,null,null,0]
[null,null,{"$f":"IF(B15<>\"\",VLOOKUP(B15,'Tipo Projeto'!$A$3:$B$36,2,0),0)","v":0},null,null,null,null,null,null,0]
[null,null,{"$f":"IF(B16<>\"\",VLOOKUP(B16,'Tipo Projeto'!$A$3:$B$36,2,0),0)","v":0},null,null,null,null,null,null,0]
[null,null,{"$f":"IF(B17<>\"\",VLOOKUP(B17,'Tipo Projeto'!$A$3:$B$36,2,0),0)","v":0},null,null,null,null,null,null,0]
[null,null,{"$f":"IF(B18<>\"\",VLOOKUP(B18,'Tipo Projeto'!$A$3:$B$36,2,0),0)","v":0},null,null,null,null,null,null,0]
[null,null,{"$f":"IF(B19<>\"\",VLOOKUP(B19,'Tipo Projeto'!$A$3:$B$36,2,0),0)","v":0},null,null,null,null,null,null,0]
[null,null,{"$f":"IF(B20<>\"\",VLOOKUP(B20,'Tipo Projeto'!$A$3:$B$36,2,0),0)","v":0},null,null,null,null,null,null,0]
[null,null,{"$f":"IF(B21<>\"\",VLOOKUP(B21,'Tipo Projeto'!$A$3:$B$36,2,0),0)","v":0},null,null,null,null,null,null,0]
[null,null,{"$f":"IF(B22<>\"\",VLOOKUP(B22,'Tipo Projeto'!$A$3:$B$36,2,0),0)","v":0},null,null,null,null,null,null,0]
[null,null,{"$f":"IF(B23<>\"\",VLOOKUP(B23,'Tipo Projeto'!$A$3:$B$36,2,0),0)","v":0},null,null,null,null,null,null,0]
[null,null,{"$f":"IF(B24<>\"\",VLOOKUP(B24,'Tipo Projeto'!$A$3:$B$36,2,0),0)","v":0},null,null,null,null,null,null,0]
[null,null,{"$f":"IF(B25<>\"\",VLOOKUP(B25,'Tipo Projeto'!$A$3:$B$36,2,0),0)","v":0},null,null,null,null,null,null,0]
[null,null,{"$f":"IF(B26<>\"\",VLOOKUP(B26,'Tipo Projeto'!$A$3:$B$36,2,0),0)","v":0},null,null,null,null,null,null,0]
[null,null,{"$f":"IF(B27<>\"\",VLOOKUP(B27,'Tipo Projeto'!$A$3:$B$36,2,0),0)","v":0},null,null,null,null,null,null,0]
[null,null,{"$f":"IF(B28<>\"\",VLOOKUP(B28,'Tipo Projeto'!$A$3:$B$36,2,0),0)","v":0},null,null,null,null,null,null,0]
[null,null,{"$f":"IF(B29<>\"\",VLOOKUP(B29,'Tipo Projeto'!$A$3:$B$36,2,0),0)","v":0},null,null,null,null,null,null,0]
[null,null,{"$f":"IF(B30<>\"\",VLOOKUP(B30,'Tipo Projeto'!$A$3:$B$36,2,0),0)","v":0},null,null,null,null,null,null,0]
[null,null,{"$f":"IF(B31<>\"\",VLOOKUP(B31,'Tipo Projeto'!$A$3:$B$36,2,0),0)","v":0},null,null,null,null,null,null,0]
[null,null,{"$f":"IF(B32<>\"\",VLOOKUP(B32,'Tipo Projeto'!$A$3:$B$36,2,0),0)","v":0},null,null,null,null,null,null,0]
[null,null,{"$f":"IF(B33<>\"\",VLOOKUP(B33,'Tipo Projeto'!$A$3:$B$36,2,0),0)","v":0},null,null,null,null,null,null,0]
[null,null,{"$f":"IF(B34<>\"\",VLOOKUP(B34,'Tipo Projeto'!$A$3:$B$36,2,0),0)","v":0},null,null,null,null,null,null,0]
[null,null,{"$f":"IF(B35<>\"\",VLOOKUP(B35,'Tipo Projeto'!$A$3:$B$36,2,0),0)","v":0},null,null,null,null,null,null,0]
[null,null,{"$f":"IF(B36<>\"\",VLOOKUP(B36,'Tipo Projeto'!$A$3:$B$36,2,0),0)","v":0},null,null,null,null,null,null,0]
[null,null,{"$f":"IF(B37<>\"\",VLOOKUP(B37,'Tipo Projeto'!$A$3:$B$36,2,0),0)","v":0},null,null,null,null,null,null,0]
[null,null,{"$f":"IF(B38<>\"\",VLOOKUP(B38,'Tipo Projeto'!$A$3:$B$36,2,0),0)","v":0},null,null,null,null,null,null,0]
[null,null,{"$f":"IF(B39<>\"\",VLOOKUP(B39,'Tipo Projeto'!$A$3:$B$36,2,0),0)","v":0},null,null,null,null,null,null,0]
[null,null,{"$f":"IF(B40<>\"\",VLOOKUP(B40,'Tipo Projeto'!$A$3:$B$36,2,0),0)","v":0},null,null,null,null,null,null,0]
[null,null,{"$f":"IF(B41<>\"\",VLOOKUP(B41,'Tipo Projeto'!$A$3:$B$36,2,0),0)","v":0},null,null,null,null,null,null,0]
[null,null,{"$f":"IF(B42<>\"\",VLOOKUP(B42,'Tipo Projeto'!$A$3:$B$36,2,0),0)","v":0},null,null,null,null,null,null,0]
[null,null,{"$f":"IF(B43<>\"\",VLOOKUP(B43,'Tipo Projeto'!$A$3:$B$36,2,0),0)","v":0},null,null,null,null,null,null,0]
[null,null,{"$f":"IF(B44<>\"\",VLOOKUP(B44,'Tipo Projeto'!$A$3:$B$36,2,0),0)","v":0},null,null,null,null,null,null,0]
[null,null,{"$f":"IF(B45<>\"\",VLOOKUP(B45,'Tipo Projeto'!$A$3:$B$36,2,0),0)","v":0},null,null,null,null,null,null,0]
[null,null,{"$f":"IF(B46<>\"\",VLOOKUP(B46,'Tipo Projeto'!$A$3:$B$36,2,0),0)","v":0},null,null,null,null,null,null,0]
[null,null,{"$f":"IF(B47<>\"\",VLOOKUP(B47,'Tipo Projeto'!$A$3:$B$36,2,0),0)","v":0},null,null,null,null,null,null,0]
[null,null,{"$f":"IF(B48<>\"\",VLOOKUP(B48,'Tipo Projeto'!$A$3:$B$36,2,0),0)","v":0},null,null,null,null,null,null,0]
[null,null,{"$f":"IF(B49<>\"\",VLOOKUP(B49,'Tipo Projeto'!$A$3:$B$36,2,0),0)","v":0},null,null,null,null,null,null,0]
[null,null,{"$f":"IF(B50<>\"\",VLOOKUP(B50,'Tipo Projeto'!$A$3:$B$36,2,0),0)","v":0},null,null,null,null,null,null,0]
[null,null,{"$f":"IF(B51<>\"\",VLOOKUP(B51,'Tipo Projeto'!$A$3:$B$36,2,0),0)","v":0},null,null,null,null,null,null,0]
[null,null,{"$f":"IF(B52<>\"\",VLOOKUP(B52,'Tipo Projeto'!$A$3:$B$36,2,0),0)","v":0},null,null,null,null,null,null,0]
[null,null,{"$f":"IF(B53<>\"\",VLOOKUP(B53,'Tipo Projeto'!$A$3:$B$36,2,0),0)","v":0},null,null,null,null,null,null,0]
[null,null,{"$f":"IF(B54<>\"\",VLOOKUP(B54,'Tipo Projeto'!$A$3:$B$36,2,0),0)","v":0},null,null,null,null,null,null,0]
[null,null,{"$f":"IF(B55<>\"\",VLOOKUP(B55,'Tipo Projeto'!$A$3:$B$36,2,0),0)","v":0},null,null,null,null,null,null,0]
[null,null,{"$f":"IF(B56<>\"\",VLOOKUP(B56,'Tipo Projeto'!$A$3:$B$36,2,0),0)","v":0},null,null,null,null,null,null,0]
[null,null,{"$f":"IF(B57<>\"\",VLOOKUP(B57,'Tipo Projeto'!$A$3:$B$36,2,0),0)","v":0},null,null,null,null,null,null,0]
[null,null,{"$f":"IF(B58<>\"\",VLOOKUP(B58,'Tipo Projeto'!$A$3:$B$36,2,0),0)","v":0},null,null,null,null,null,null,0]
[null,null,{"$f":"IF(B59<>\"\",VLOOKUP(B59,'Tipo Projeto'!$A$3:$B$36,2,0),0)","v":0},null,null,null,null,null,null,0]
[null,null,{"$f":"IF(B60<>\"\",VLOOKUP(B60,'Tipo Projeto'!$A$3:$B$36,2,0),0)","v":0},null,null,null,null,null,null,0]
[null,null,{"$f":"IF(B61<>\"\",VLOOKUP(B61,'Tipo Projeto'!$A$3:$B$36,2,0),0)","v":0},null,null,null,null,null,null,0]
[null,null,{"$f":"IF(B62<>\"\",VLOOKUP(B62,'Tipo Projeto'!$A$3:$B$36,2,0),0)","v":0},null,null,null,null,null,null,0]
[null,null,{"$f":"IF(B63<>\"\",VLOOKUP(B63,'Tipo Projeto'!$A$3:$B$36,2,0),0)","v":0},null,null,null,null,null,null,0]
[null,null,{"$f":"IF(B64<>\"\",VLOOKUP(B64,'Tipo Projeto'!$A$3:$B$36,2,0),0)","v":0},null,null,null,null,null,null,0]
[null,null,{"$f":"IF(B65<>\"\",VLOOKUP(B65,'Tipo Projeto'!$A$3:$B$36,2,0),0)","v":0},null,null,null,null,null,null,0]
[null,null,{"$f":"IF(B66<>\"\",VLOOKUP(B66,'Tipo Projeto'!$A$3:$B$36,2,0),0)","v":0},null,null,null,null,null,null,0]
[null,null,{"$f":"IF(B67<>\"\",VLOOKUP(B67,'Tipo Projeto'!$A$3:$B$36,2,0),0)","v":0},null,null,null,null,null,null,0]
[null,null,{"$f":"IF(B68<>\"\",VLOOKUP(B68,'Tipo Projeto'!$A$3:$B$36,2,0),0)","v":0},null,null,null,null,null,null,0]
[null,null,{"$f":"IF(B69<>\"\",VLOOKUP(B69,'Tipo Projeto'!$A$3:$B$36,2,0),0)","v":0},null,null,null,null,null,null,0]
[null,null,{"$f":"IF(B70<>\"\",VLOOKUP(B70,'Tipo Projeto'!$A$3:$B$36,2,0),0)","v":0},null,null,null,null,null,null,0]
[null,null,{"$f":"IF(B71<>\"\",VLOOKUP(B71,'Tipo Projeto'!$A$3:$B$36,2,0),0)","v":0},null,null,null,null,null,null,0]
[null,null,{"$f":"IF(B72<>\"\",VLOOKUP(B72,'Tipo Projeto'!$A$3:$B$36,2,0),0)","v":0},null,null,null,null,null,null,0]
[null,null,{"$f":"IF(B73<>\"\",VLOOKUP(B73,'Tipo Projeto'!$A$3:$B$36,2,0),0)","v":0},null,null,null,null,null,null,0]
[null,null,{"$f":"IF(B74<>\"\",VLOOKUP(B74,'Tipo Projeto'!$A$3:$B$36,2,0),0)","v":0},null,null,null,null,null,null,0]
[null,null,{"$f":"IF(B75<>\"\",VLOOKUP(B75,'Tipo Projeto'!$A$3:$B$36,2,0),0)","v":0},null,null,null,null,null,null,{"$f":"IF(B75<>\"Manutenção em interface\",IF(B75<>\"Desenv., Manutenção e Publicação de Páginas Estáticas\",IF(I75=\"EE\",4,IF(I75=\"CE\",4,IF(I75=\"SE\",5,IF(I75=\"ALI\",7,IF(I75=\"AIE\",5,0)))))*C75,C75),C75)","v":0}]
[null,null,{"$f":"IF(B76<>\"\",VLOOKUP(B76,'Tipo Projeto'!$A$3:$B$36,2,0),0)","v":0},null,null,null,null,null,null,0]
[null,null,{"$f":"IF(B77<>\"\",VLOOKUP(B77,'Tipo Projeto'!$A$3:$B$36,2,0),0)","v":0},null,null,null,null,null,null,0]
[null,null,{"$f":"IF(B78<>\"\",VLOOKUP(B78,'Tipo Projeto'!$A$3:$B$36,2,0),0)","v":0},null,null,null,null,null,null,0]
[null,null,{"$f":"IF(B79<>\"\",VLOOKUP(B79,'Tipo Projeto'!$A$3:$B$36,2,0),0)","v":0},null,null,null,null,null,null,0]
[null,null,{"$f":"IF(B80<>\"\",VLOOKUP(B80,'Tipo Projeto'!$A$3:$B$36,2,0),0)","v":0},null,null,null,null,null,null,0]
[null,null,{"$f":"IF(B81<>\"\",VLOOKUP(B81,'Tipo Projeto'!$A$3:$B$36,2,0),0)","v":0},null,null,null,null,null,null,0]
[null,null,{"$f":"IF(B82<>\"\",VLOOKUP(B82,'Tipo Projeto'!$A$3:$B$36,2,0),0)","v":0},null,null,null,null,null,null,0]
[null,null,{"$f":"IF(B83<>\"\",VLOOKUP(B83,'Tipo Projeto'!$A$3:$B$36,2,0),0)","v":0},null,null,null,null,null,null,0]
[null,null,{"$f":"IF(B84<>\"\",VLOOKUP(B84,'Tipo Projeto'!$A$3:$B$36,2,0),0)","v":0},null,null,null,null,null,null,0]
[null,null,{"$f":"IF(B85<>\"\",VLOOKUP(B85,'Tipo Projeto'!$A$3:$B$36,2,0),0)","v":0},null,null,null,null,null,null,0]
[null,null,{"$f":"IF(B86<>\"\",VLOOKUP(B86,'Tipo Projeto'!$A$3:$B$36,2,0),0)","v":0},null,null,null,null,null,null,0]
[null,null,{"$f":"IF(B87<>\"\",VLOOKUP(B87,'Tipo Projeto'!$A$3:$B$36,2,0),0)","v":0},null,null,null,null,null,null,0]
[null,null,{"$f":"IF(B88<>\"\",VLOOKUP(B88,'Tipo Projeto'!$A$3:$B$36,2,0),0)","v":0},null,null,null,null,null,null,0]
[null,null,{"$f":"IF(B89<>\"\",VLOOKUP(B89,'Tipo Projeto'!$A$3:$B$36,2,0),0)","v":0},null,null,null,null,null,null,0]
[null,null,{"$f":"IF(B90<>\"\",VLOOKUP(B90,'Tipo Projeto'!$A$3:$B$36,2,0),0)","v":0},null,null,null,null,null,null,0]
[null,null,{"$f":"IF(B91<>\"\",VLOOKUP(B91,'Tipo Projeto'!$A$3:$B$36,2,0),0)","v":0},null,null,null,null,null,null,0]
[null,null,{"$f":"IF(B92<>\"\",VLOOKUP(B92,'Tipo Projeto'!$A$3:$B$36,2,0),0)","v":0},null,null,null,null,null,null,0]
[null,null,{"$f":"IF(B93<>\"\",VLOOKUP(B93,'Tipo Projeto'!$A$3:$B$36,2,0),0)","v":0},null,null,null,null,null,null,0]
[null,null,{"$f":"IF(B94<>\"\",VLOOKUP(B94,'Tipo Projeto'!$A$3:$B$36,2,0),0)","v":0},null,null,null,null,null,null,0]
[null,null,{"$f":"IF(B95<>\"\",VLOOKUP(B95,'Tipo Projeto'!$A$3:$B$36,2,0),0)","v":0},null,null,null,null,null,null,0]
[null,null,{"$f":"IF(B96<>\"\",VLOOKUP(B96,'Tipo Projeto'!$A$3:$B$36,2,0),0)","v":0},null,null,null,null,null,null,0]
[null,null,{"$f":"IF(B97<>\"\",VLOOKUP(B97,'Tipo Projeto'!$A$3:$B$36,2,0),0)","v":0},null,null,null,null,null,null,0]
[null,null,{"$f":"IF(B98<>\"\",VLOOKUP(B98,'Tipo Projeto'!$A$3:$B$36,2,0),0)","v":0},null,null,null,null,null,null,0]
[null,null,{"$f":"IF(B99<>\"\",VLOOKUP(B99,'Tipo Projeto'!$A$3:$B$36,2,0),0)","v":0},null,null,null,null,null,null,0]
[null,null,{"$f":"IF(B100<>\"\",VLOOKUP(B100,'Tipo Projeto'!$A$3:$B$36,2,0),0)","v":0},null,null,null,null,null,null,0]
[null,null,{"$f":"IF(B101<>\"\",VLOOKUP(B101,'Tipo Projeto'!$A$3:$B$36,2,0),0)","v":0},null,null,null,null,null,null,0]
[null,null,{"$f":"IF(B102<>\"\",VLOOKUP(B102,'Tipo Projeto'!$A$3:$B$36,2,0),0)","v":0},null,null,null,null,null,null,0]
[null,null,{"$f":"IF(B103<>\"\",VLOOKUP(B103,'Tipo Projeto'!$A$3:$B$36,2,0),0)","v":0},null,null,null,null,null,null,0]
[null,null,{"$f":"IF(B104<>\"\",VLOOKUP(B104,'Tipo Projeto'!$A$3:$B$36,2,0),0)","v":0},null,null,null,null,null,null,0]
[null,null,{"$f":"IF(B105<>\"\",VLOOKUP(B105,'Tipo Projeto'!$A$3:$B$36,2,0),0)","v":0},null,null,null,null,null,null,0]
[null,null,{"$f":"IF(B106<>\"\",VLOOKUP(B106,'Tipo Projeto'!$A$3:$B$36,2,0),0)","v":0},null,null,null,null,null,null,0]
[null,null,{"$f":"IF(B107<>\"\",VLOOKUP(B107,'Tipo Projeto'!$A$3:$B$36,2,0),0)","v":0},null,null,null,null,null,null,0]
[null,null,{"$f":"IF(B108<>\"\",VLOOKUP(B108,'Tipo Projeto'!$A$3:$B$36,2,0),0)","v":0},null,null,null,null,null,null,0]
[null,null,{"$f":"IF(B109<>\"\",VLOOKUP(B109,'Tipo Projeto'!$A$3:$B$36,2,0),0)","v":0},null,null,null,null,null,null,0]
[null,null,{"$f":"IF(B110<>\"\",VLOOKUP(B110,'Tipo Projeto'!$A$3:$B$36,2,0),0)","v":0},null,null,null,null,null,null,0]
[null,null,{"$f":"IF(B111<>\"\",VLOOKUP(B111,'Tipo Projeto'!$A$3:$B$36,2,0),0)","v":0},null,null,null,null,null,null,0]
[null,null,{"$f":"IF(B112<>\"\",VLOOKUP(B112,'Tipo Projeto'!$A$3:$B$36,2,0),0)","v":0},null,null,null,null,null,null,0]
[null,null,{"$f":"IF(B113<>\"\",VLOOKUP(B113,'Tipo Projeto'!$A$3:$B$36,2,0),0)","v":0},null,null,null,null,null,null,0]
[null,null,{"$f":"IF(B114<>\"\",VLOOKUP(B114,'Tipo Projeto'!$A$3:$B$36,2,0),0)","v":0},null,null,null,null,null,null,0]
[null,null,{"$f":"IF(B115<>\"\",VLOOKUP(B115,'Tipo Projeto'!$A$3:$B$36,2,0),0)","v":0},null,null,null,null,null,null,0]
[null,null,{"$f":"IF(B116<>\"\",VLOOKUP(B116,'Tipo Projeto'!$A$3:$B$36,2,0),0)","v":0},null,null,null,null,null,null,0]
[null,null,{"$f":"IF(B117<>\"\",VLOOKUP(B117,'Tipo Projeto'!$A$3:$B$36,2,0),0)","v":0},null,null,null,null,null,null,0]
[null,null,{"$f":"IF(B118<>\"\",VLOOKUP(B118,'Tipo Projeto'!$A$3:$B$36,2,0),0)","v":0},null,null,null,null,null,null,0]
[null,null,{"$f":"IF(B119<>\"\",VLOOKUP(B119,'Tipo Projeto'!$A$3:$B$36,2,0),0)","v":0},null,null,null,null,null,null,0]
[null,null,{"$f":"IF(B120<>\"\",VLOOKUP(B120,'Tipo Projeto'!$A$3:$B$36,2,0),0)","v":0},null,null,null,null,null,null,0]
[null,null,{"$f":"IF(B121<>\"\",VLOOKUP(B121,'Tipo Projeto'!$A$3:$B$36,2,0),0)","v":0},null,null,null,null,null,null,0]
[null,null,{"$f":"IF(B122<>\"\",VLOOKUP(B122,'Tipo Projeto'!$A$3:$B$36,2,0),0)","v":0},null,null,null,null,null,null,0]
[null,null,{"$f":"IF(B123<>\"\",VLOOKUP(B123,'Tipo Projeto'!$A$3:$B$36,2,0),0)","v":0},null,null,null,null,null,null,0]
[null,null,{"$f":"IF(B124<>\"\",VLOOKUP(B124,'Tipo Projeto'!$A$3:$B$36,2,0),0)","v":0},null,null,null,null,null,null,0]
[null,null,{"$f":"IF(B125<>\"\",VLOOKUP(B125,'Tipo Projeto'!$A$3:$B$36,2,0),0)","v":0},null,null,null,null,null,null,0]
[null,null,{"$f":"IF(B126<>\"\",VLOOKUP(B126,'Tipo Projeto'!$A$3:$B$36,2,0),0)","v":0},null,null,null,null,null,null,0]
[null,null,{"$f":"IF(B127<>\"\",VLOOKUP(B127,'Tipo Projeto'!$A$3:$B$36,2,0),0)","v":0},null,null,null,null,null,null,0]
[null,null,{"$f":"IF(B128<>\"\",VLOOKUP(B128,'Tipo Projeto'!$A$3:$B$36,2,0),0)","v":0},null,null,null,null,null,null,0]
[null,null,{"$f":"IF(B129<>\"\",VLOOKUP(B129,'Tipo Projeto'!$A$3:$B$36,2,0),0)","v":0},null,null,null,null,null,null,0]
[null,null,{"$f":"IF(B130<>\"\",VLOOKUP(B130,'Tipo Projeto'!$A$3:$B$36,2,0),0)","v":0},null,null,null,null,null,null,0]
[null,null,{"$f":"IF(B131<>\"\",VLOOKUP(B131,'Tipo Projeto'!$A$3:$B$36,2,0),0)","v":0},null,null,null,null,null,null,0]
[null,null,{"$f":"IF(B132<>\"\",VLOOKUP(B132,'Tipo Projeto'!$A$3:$B$36,2,0),0)","v":0},null,null,null,null,null,null,0]
[null,null,{"$f":"IF(B133<>\"\",VLOOKUP(B133,'Tipo Projeto'!$A$3:$B$36,2,0),0)","v":0},null,null,null,null,null,null,0]
[null,null,{"$f":"IF(B134<>\"\",VLOOKUP(B134,'Tipo Projeto'!$A$3:$B$36,2,0),0)","v":0},null,null,null,null,null,null,0]
[null,null,{"$f":"IF(B135<>\"\",VLOOKUP(B135,'Tipo Projeto'!$A$3:$B$36,2,0),0)","v":0},null,null,null,null,null,null,0]
[null,null,{"$f":"IF(B136<>\"\",VLOOKUP(B136,'Tipo Projeto'!$A$3:$B$36,2,0),0)","v":0},null,null,null,null,null,null,0]
[null,null,{"$f":"IF(B137<>\"\",VLOOKUP(B137,'Tipo Projeto'!$A$3:$B$36,2,0),0)","v":0},null,null,null,null,null,null,0]
[null,null,{"$f":"IF(B138<>\"\",VLOOKUP(B138,'Tipo Projeto'!$A$3:$B$36,2,0),0)","v":0},null,null,null,null,null,null,0]
[null,null,{"$f":"IF(B139<>\"\",VLOOKUP(B139,'Tipo Projeto'!$A$3:$B$36,2,0),0)","v":0},null,null,null,null,null,null,{"$f":"IF(B139<>\"Manutenção em interface\",IF(B139<>\"Desenv., Manutenção e Publicação de Páginas Estáticas\",IF(I139=\"EE\",4,IF(I139=\"CE\",4,IF(I139=\"SE\",5,IF(I139=\"ALI\",7,IF(I139=\"AIE\",5,0)))))*C139,C139),C139)","v":0}]
[null,null,{"$f":"IF(B140<>\"\",VLOOKUP(B140,'Tipo Projeto'!$A$3:$B$36,2,0),0)","v":0},null,null,null,null,null,null,0]
[null,null,{"$f":"IF(B141<>\"\",VLOOKUP(B141,'Tipo Projeto'!$A$3:$B$36,2,0),0)","v":0},null,null,null,null,null,null,0]
[null,null,{"$f":"IF(B142<>\"\",VLOOKUP(B142,'Tipo Projeto'!$A$3:$B$36,2,0),0)","v":0},null,null,null,null,null,null,0]
[null,null,{"$f":"IF(B143<>\"\",VLOOKUP(B143,'Tipo Projeto'!$A$3:$B$36,2,0),0)","v":0},null,null,null,null,null,null,0]
[null,null,{"$f":"IF(B144<>\"\",VLOOKUP(B144,'Tipo Projeto'!$A$3:$B$36,2,0),0)","v":0},null,null,null,null,null,null,0]
[null,null,{"$f":"IF(B145<>\"\",VLOOKUP(B145,'Tipo Projeto'!$A$3:$B$36,2,0),0)","v":0},null,null,null,null,null,null,0]
[null,null,{"$f":"IF(B146<>\"\",VLOOKUP(B146,'Tipo Projeto'!$A$3:$B$36,2,0),0)","v":0},null,null,null,null,null,null,0]
[null,null,{"$f":"IF(B147<>\"\",VLOOKUP(B147,'Tipo Projeto'!$A$3:$B$36,2,0),0)","v":0},null,null,null,null,null,null,0]
[null,null,{"$f":"IF(B148<>\"\",VLOOKUP(B148,'Tipo Projeto'!$A$3:$B$36,2,0),0)","v":0},null,null,null,null,null,null,0]
[null,null,{"$f":"IF(B149<>\"\",VLOOKUP(B149,'Tipo Projeto'!$A$3:$B$36,2,0),0)","v":0},null,null,null,null,null,null,0]
[null,null,{"$f":"IF(B150<>\"\",VLOOKUP(B150,'Tipo Projeto'!$A$3:$B$36,2,0),0)","v":0},null,null,null,null,null,null,0]
[null,null,{"$f":"IF(B151<>\"\",VLOOKUP(B151,'Tipo Projeto'!$A$3:$B$36,2,0),0)","v":0},null,null,null,null,null,null,0]
[null,null,{"$f":"IF(B152<>\"\",VLOOKUP(B152,'Tipo Projeto'!$A$3:$B$36,2,0),0)","v":0},null,null,null,null,null,null,0]
[null,null,{"$f":"IF(B153<>\"\",VLOOKUP(B153,'Tipo Projeto'!$A$3:$B$36,2,0),0)","v":0},null,null,null,null,null,null,0]
[null,null,{"$f":"IF(B154<>\"\",VLOOKUP(B154,'Tipo Projeto'!$A$3:$B$36,2,0),0)","v":0},null,null,null,null,null,null,0]
[null,null,{"$f":"IF(B155<>\"\",VLOOKUP(B155,'Tipo Projeto'!$A$3:$B$36,2,0),0)","v":0},null,null,null,null,null,null,0]
[null,null,{"$f":"IF(B156<>\"\",VLOOKUP(B156,'Tipo Projeto'!$A$3:$B$36,2,0),0)","v":0},null,null,null,null,null,null,0]
[null,null,{"$f":"IF(B157<>\"\",VLOOKUP(B157,'Tipo Projeto'!$A$3:$B$36,2,0),0)","v":0},null,null,null,null,null,null,0]
[null,null,{"$f":"IF(B158<>\"\",VLOOKUP(B158,'Tipo Projeto'!$A$3:$B$36,2,0),0)","v":0},null,null,null,null,null,null,0]
[null,null,{"$f":"IF(B159<>\"\",VLOOKUP(B159,'Tipo Projeto'!$A$3:$B$36,2,0),0)","v":0},null,null,null,null,null,null,0]
[null,null,{"$f":"IF(B160<>\"\",VLOOKUP(B160,'Tipo Projeto'!$A$3:$B$36,2,0),0)","v":0},null,null,null,null,null,null,0]
[null,null,{"$f":"IF(B161<>\"\",VLOOKUP(B161,'Tipo Projeto'!$A$3:$B$36,2,0),0)","v":0},null,null,null,null,null,null,0]
[null,null,{"$f":"IF(B162<>\"\",VLOOKUP(B162,'Tipo Projeto'!$A$3:$B$36,2,0),0)","v":0},null,null,null,null,null,null,0]
[null,null,{"$f":"IF(B163<>\"\",VLOOKUP(B163,'Tipo Projeto'!$A$3:$B$36,2,0),0)","v":0},null,null,null,null,null,null,0]
[null,null,{"$f":"IF(B164<>\"\",VLOOKUP(B164,'Tipo Projeto'!$A$3:$B$36,2,0),0)","v":0},null,null,null,null,null,null,0]
[null,null,{"$f":"IF(B165<>\"\",VLOOKUP(B165,'Tipo Projeto'!$A$3:$B$36,2,0),0)","v":0},null,null,null,null,null,null,0]
[null,null,{"$f":"IF(B166<>\"\",VLOOKUP(B166,'Tipo Projeto'!$A$3:$B$36,2,0),0)","v":0},null,null,null,null,null,null,0]
[null,null,{"$f":"IF(B167<>\"\",VLOOKUP(B167,'Tipo Projeto'!$A$3:$B$36,2,0),0)","v":0},null,null,null,null,null,null,0]
[null,null,{"$f":"IF(B168<>\"\",VLOOKUP(B168,'Tipo Projeto'!$A$3:$B$36,2,0),0)","v":0},null,null,null,null,null,null,0]
[null,null,{"$f":"IF(B169<>\"\",VLOOKUP(B169,'Tipo Projeto'!$A$3:$B$36,2,0),0)","v":0},null,null,null,null,null,null,0]
[null,null,{"$f":"IF(B170<>\"\",VLOOKUP(B170,'Tipo Projeto'!$A$3:$B$36,2,0),0)","v":0},null,null,null,null,null,null,0]
[null,null,{"$f":"IF(B171<>\"\",VLOOKUP(B171,'Tipo Projeto'!$A$3:$B$36,2,0),0)","v":0},null,null,null,null,null,null,0]
[null,null,{"$f":"IF(B172<>\"\",VLOOKUP(B172,'Tipo Projeto'!$A$3:$B$36,2,0),0)","v":0},null,null,null,null,null,null,0]
[null,null,{"$f":"IF(B173<>\"\",VLOOKUP(B173,'Tipo Projeto'!$A$3:$B$36,2,0),0)","v":0},null,null,null,null,null,null,0]
[null,null,{"$f":"IF(B174<>\"\",VLOOKUP(B174,'Tipo Projeto'!$A$3:$B$36,2,0),0)","v":0},null,null,null,null,null,null,0]
[null,null,{"$f":"IF(B175<>\"\",VLOOKUP(B175,'Tipo Projeto'!$A$3:$B$36,2,0),0)","v":0},null,null,null,null,null,null,0]
[null,null,{"$f":"IF(B176<>\"\",VLOOKUP(B176,'Tipo Projeto'!$A$3:$B$36,2,0),0)","v":0},null,null,null,null,null,null,0]
[null,null,{"$f":"IF(B177<>\"\",VLOOKUP(B177,'Tipo Projeto'!$A$3:$B$36,2,0),0)","v":0},null,null,null,null,null,null,0]
[null,null,{"$f":"IF(B178<>\"\",VLOOKUP(B178,'Tipo Projeto'!$A$3:$B$36,2,0),0)","v":0},null,null,null,null,null,null,0]
[null,null,{"$f":"IF(B179<>\"\",VLOOKUP(B179,'Tipo Projeto'!$A$3:$B$36,2,0),0)","v":0},null,null,null,null,null,null,0]
[null,null,{"$f":"IF(B180<>\"\",VLOOKUP(B180,'Tipo Projeto'!$A$3:$B$36,2,0),0)","v":0},null,null,null,null,null,null,0]
[null,null,{"$f":"IF(B181<>\"\",VLOOKUP(B181,'Tipo Projeto'!$A$3:$B$36,2,0),0)","v":0},null,null,null,null,null,null,0]
[null,null,{"$f":"IF(B182<>\"\",VLOOKUP(B182,'Tipo Projeto'!$A$3:$B$36,2,0),0)","v":0},null,null,null,null,null,null,0]
[null,null,{"$f":"IF(B183<>\"\",VLOOKUP(B183,'Tipo Projeto'!$A$3:$B$36,2,0),0)","v":0},null,null,null,null,null,null,0]
[null,null,{"$f":"IF(B184<>\"\",VLOOKUP(B184,'Tipo Projeto'!$A$3:$B$36,2,0),0)","v":0},null,null,null,null,null,null,0]
[null,null,{"$f":"IF(B185<>\"\",VLOOKUP(B185,'Tipo Projeto'!$A$3:$B$36,2,0),0)","v":0},null,null,null,null,null,null,0]
[null,null,{"$f":"IF(B186<>\"\",VLOOKUP(B186,'Tipo Projeto'!$A$3:$B$36,2,0),0)","v":0},null,null,null,null,null,null,0]
[null,null,{"$f":"IF(B187<>\"\",VLOOKUP(B187,'Tipo Projeto'!$A$3:$B$36,2,0),0)","v":0},null,null,null,null,null,null,0]
[null,null,{"$f":"IF(B188<>\"\",VLOOKUP(B188,'Tipo Projeto'!$A$3:$B$36,2,0),0)","v":0},null,null,null,null,null,null,0]
[null,null,{"$f":"IF(B189<>\"\",VLOOKUP(B189,'Tipo Projeto'!$A$3:$B$36,2,0),0)","v":0},null,null,null,null,null,null,0]
[null,null,{"$f":"IF(B190<>\"\",VLOOKUP(B190,'Tipo Projeto'!$A$3:$B$36,2,0),0)","v":0},null,null,null,null,null,null,0]
[null,null,{"$f":"IF(B191<>\"\",VLOOKUP(B191,'Tipo Projeto'!$A$3:$B$36,2,0),0)","v":0},null,null,null,null,null,null,0]
[null,null,{"$f":"IF(B192<>\"\",VLOOKUP(B192,'Tipo Projeto'!$A$3:$B$36,2,0),0)","v":0},null,null,null,null,null,null,0]
[null,null,{"$f":"IF(B193<>\"\",VLOOKUP(B193,'Tipo Projeto'!$A$3:$B$36,2,0),0)","v":0},null,null,null,null,null,null,0]
[null,null,{"$f":"IF(B194<>\"\",VLOOKUP(B194,'Tipo Projeto'!$A$3:$B$36,2,0),0)","v":0},null,null,null,null,null,null,0]
[null,null,{"$f":"IF(B195<>\"\",VLOOKUP(B195,'Tipo Projeto'!$A$3:$B$36,2,0),0)","v":0},null,null,null,null,null,null,0]
[null,null,{"$f":"IF(B196<>\"\",VLOOKUP(B196,'Tipo Projeto'!$A$3:$B$36,2,0),0)","v":0},null,null,null,null,null,null,0]
[null,null,{"$f":"IF(B197<>\"\",VLOOKUP(B197,'Tipo Projeto'!$A$3:$B$36,2,0),0)","v":0},null,null,null,null,null,null,0]
[null,null,{"$f":"IF(B198<>\"\",VLOOKUP(B198,'Tipo Projeto'!$A$3:$B$36,2,0),0)","v":0},null,null,null,null,null,null,0]
[null,null,{"$f":"IF(B199<>\"\",VLOOKUP(B199,'Tipo Projeto'!$A$3:$B$36,2,0),0)","v":0},null,null,null,null,null,null,0]
[null,null,{"$f":"IF(B200<>\"\",VLOOKUP(B200,'Tipo Projeto'!$A$3:$B$36,2,0),0)","v":0},null,null,null,null,null,null,0]
[null,null,{"$f":"IF(B201<>\"\",VLOOKUP(B201,'Tipo Projeto'!$A$3:$B$36,2,0),0)","v":0},null,null,null,null,null,null,0]
[null,null,{"$f":"IF(B202<>\"\",VLOOKUP(B202,'Tipo Projeto'!$A$3:$B$36,2,0),0)","v":0},null,null,null,null,null,null,0]
[null,null,{"$f":"IF(B203<>\"\",VLOOKUP(B203,'Tipo Projeto'!$A$3:$B$36,2,0),0)","v":0},null,null,null,null,null,null,{"$f":"IF(B203<>\"Manutenção em interface\",IF(B203<>\"Desenv., Manutenção e Publicação de Páginas Estáticas\",IF(I203=\"EE\",4,IF(I203=\"CE\",4,IF(I203=\"SE\",5,IF(I203=\"ALI\",7,IF(I203=\"AIE\",5,0)))))*C203,C203),C203)","v":0}]
[null,null,{"$f":"IF(B204<>\"\",VLOOKUP(B204,'Tipo Projeto'!$A$3:$B$36,2,0),0)","v":0},null,null,null,null,null,null,0]
[null,null,{"$f":"IF(B205<>\"\",VLOOKUP(B205,'Tipo Projeto'!$A$3:$B$36,2,0),0)","v":0},null,null,null,null,null,null,0]
[null,null,{"$f":"IF(B206<>\"\",VLOOKUP(B206,'Tipo Projeto'!$A$3:$B$36,2,0),0)","v":0},null,null,null,null,null,null,0]
[null,null,{"$f":"IF(B207<>\"\",VLOOKUP(B207,'Tipo Projeto'!$A$3:$B$36,2,0),0)","v":0},null,null,null,null,null,null,0]
[null,null,{"$f":"IF(B208<>\"\",VLOOKUP(B208,'Tipo Projeto'!$A$3:$B$36,2,0),0)","v":0},null,null,null,null,null,null,0]
[null,null,{"$f":"IF(B209<>\"\",VLOOKUP(B209,'Tipo Projeto'!$A$3:$B$36,2,0),0)","v":0},null,null,null,null,null,null,0]
[null,null,{"$f":"IF(B210<>\"\",VLOOKUP(B210,'Tipo Projeto'!$A$3:$B$36,2,0),0)","v":0},null,null,null,null,null,null,0]
[null,null,{"$f":"IF(B211<>\"\",VLOOKUP(B211,'Tipo Projeto'!$A$3:$B$36,2,0),0)","v":0},null,null,null,null,null,null,0]
[null,null,{"$f":"IF(B212<>\"\",VLOOKUP(B212,'Tipo Projeto'!$A$3:$B$36,2,0),0)","v":0},null,null,null,null,null,null,0]
[null,null,{"$f":"IF(B213<>\"\",VLOOKUP(B213,'Tipo Projeto'!$A$3:$B$36,2,0),0)","v":0},null,null,null,null,null,null,0]
[null,null,{"$f":"IF(B214<>\"\",VLOOKUP(B214,'Tipo Projeto'!$A$3:$B$36,2,0),0)","v":0},null,null,null,null,null,null,0]
[null,null,{"$f":"IF(B215<>\"\",VLOOKUP(B215,'Tipo Projeto'!$A$3:$B$36,2,0),0)","v":0},null,null,null,null,null,null,0]
[null,null,{"$f":"IF(B216<>\"\",VLOOKUP(B216,'Tipo Projeto'!$A$3:$B$36,2,0),0)","v":0},null,null,null,null,null,null,0]
[null,null,{"$f":"IF(B217<>\"\",VLOOKUP(B217,'Tipo Projeto'!$A$3:$B$36,2,0),0)","v":0},null,null,null,null,null,null,0]
[null,null,{"$f":"IF(B218<>\"\",VLOOKUP(B218,'Tipo Projeto'!$A$3:$B$36,2,0),0)","v":0},null,null,null,null,null,null,0]
[null,null,{"$f":"IF(B219<>\"\",VLOOKUP(B219,'Tipo Projeto'!$A$3:$B$36,2,0),0)","v":0},null,null,null,null,null,null,0]
[null,null,{"$f":"IF(B220<>\"\",VLOOKUP(B220,'Tipo Projeto'!$A$3:$B$36,2,0),0)","v":0},null,null,null,null,null,null,0]
[null,null,{"$f":"IF(B221<>\"\",VLOOKUP(B221,'Tipo Projeto'!$A$3:$B$36,2,0),0)","v":0},null,null,null,null,null,null,0]
[null,null,{"$f":"IF(B222<>\"\",VLOOKUP(B222,'Tipo Projeto'!$A$3:$B$36,2,0),0)","v":0},null,null,null,null,null,null,0]
[null,null,{"$f":"IF(B223<>\"\",VLOOKUP(B223,'Tipo Projeto'!$A$3:$B$36,2,0),0)","v":0},null,null,null,null,null,null,0]
[null,null,{"$f":"IF(B224<>\"\",VLOOKUP(B224,'Tipo Projeto'!$A$3:$B$36,2,0),0)","v":0},null,null,null,null,null,null,0]
[null,null,{"$f":"IF(B225<>\"\",VLOOKUP(B225,'Tipo Projeto'!$A$3:$B$36,2,0),0)","v":0},null,null,null,null,null,null,0]
[null,null,{"$f":"IF(B226<>\"\",VLOOKUP(B226,'Tipo Projeto'!$A$3:$B$36,2,0),0)","v":0},null,null,null,null,null,null,0]
[null,null,{"$f":"IF(B227<>\"\",VLOOKUP(B227,'Tipo Projeto'!$A$3:$B$36,2,0),0)","v":0},null,null,null,null,null,null,0]
[null,null,{"$f":"IF(B228<>\"\",VLOOKUP(B228,'Tipo Projeto'!$A$3:$B$36,2,0),0)","v":0},null,null,null,null,null,null,0]
[null,null,{"$f":"IF(B229<>\"\",VLOOKUP(B229,'Tipo Projeto'!$A$3:$B$36,2,0),0)","v":0},null,null,null,null,null,null,0]
[null,null,{"$f":"IF(B230<>\"\",VLOOKUP(B230,'Tipo Projeto'!$A$3:$B$36,2,0),0)","v":0},null,null,null,null,null,null,0]
[null,null,{"$f":"IF(B231<>\"\",VLOOKUP(B231,'Tipo Projeto'!$A$3:$B$36,2,0),0)","v":0},null,null,null,null,null,null,0]
[null,null,{"$f":"IF(B232<>\"\",VLOOKUP(B232,'Tipo Projeto'!$A$3:$B$36,2,0),0)","v":0},null,null,null,null,null,null,0]
[null,null,{"$f":"IF(B233<>\"\",VLOOKUP(B233,'Tipo Projeto'!$A$3:$B$36,2,0),0)","v":0},null,null,null,null,null,null,0]
[null,null,{"$f":"IF(B234<>\"\",VLOOKUP(B234,'Tipo Projeto'!$A$3:$B$36,2,0),0)","v":0},null,null,null,null,null,null,0]
[null,null,{"$f":"IF(B235<>\"\",VLOOKUP(B235,'Tipo Projeto'!$A$3:$B$36,2,0),0)","v":0},null,null,null,null,null,null,0]
[null,null,{"$f":"IF(B236<>\"\",VLOOKUP(B236,'Tipo Projeto'!$A$3:$B$36,2,0),0)","v":0},null,null,null,null,null,null,0]
[null,null,{"$f":"IF(B237<>\"\",VLOOKUP(B237,'Tipo Projeto'!$A$3:$B$36,2,0),0)","v":0},null,null,null,null,null,null,0]
[null,null,{"$f":"IF(B238<>\"\",VLOOKUP(B238,'Tipo Projeto'!$A$3:$B$36,2,0),0)","v":0},null,null,null,null,null,null,0]
[null,null,{"$f":"IF(B239<>\"\",VLOOKUP(B239,'Tipo Projeto'!$A$3:$B$36,2,0),0)","v":0},null,null,null,null,null,null,0]
[null,null,{"$f":"IF(B240<>\"\",VLOOKUP(B240,'Tipo Projeto'!$A$3:$B$36,2,0),0)","v":0},null,null,null,null,null,null,0]
[null,null,{"$f":"IF(B241<>\"\",VLOOKUP(B241,'Tipo Projeto'!$A$3:$B$36,2,0),0)","v":0},null,null,null,null,null,null,0]
[null,null,{"$f":"IF(B242<>\"\",VLOOKUP(B242,'Tipo Projeto'!$A$3:$B$36,2,0),0)","v":0},null,null,null,null,null,null,0]
[null,null,{"$f":"IF(B243<>\"\",VLOOKUP(B243,'Tipo Projeto'!$A$3:$B$36,2,0),0)","v":0},null,null,null,null,null,null,0]
[null,null,{"$f":"IF(B244<>\"\",VLOOKUP(B244,'Tipo Projeto'!$A$3:$B$36,2,0),0)","v":0},null,null,null,null,null,null,0]
[null,null,{"$f":"IF(B245<>\"\",VLOOKUP(B245,'Tipo Projeto'!$A$3:$B$36,2,0),0)","v":0},null,null,null,null,null,null,0]
[null,null,{"$f":"IF(B246<>\"\",VLOOKUP(B246,'Tipo Projeto'!$A$3:$B$36,2,0),0)","v":0},null,null,null,null,null,null,0]
[null,null,{"$f":"IF(B247<>\"\",VLOOKUP(B247,'Tipo Projeto'!$A$3:$B$36,2,0),0)","v":0},null,null,null,null,null,null,0]
[null,null,{"$f":"IF(B248<>\"\",VLOOKUP(B248,'Tipo Projeto'!$A$3:$B$36,2,0),0)","v":0},null,null,null,null,null,null,0]
[null,null,{"$f":"IF(B249<>\"\",VLOOKUP(B249,'Tipo Projeto'!$A$3:$B$36,2,0),0)","v":0},null,null,null,null,null,null,0]
[null,null,{"$f":"IF(B250<>\"\",VLOOKUP(B250,'Tipo Projeto'!$A$3:$B$36,2,0),0)","v":0},null,null,null,null,null,null,0]
[null,null,{"$f":"IF(B251<>\"\",VLOOKUP(B251,'Tipo Projeto'!$A$3:$B$36,2,0),0)","v":0},null,null,null,null,null,null,0]
[null,null,{"$f":"IF(B252<>\"\",VLOOKUP(B252,'Tipo Projeto'!$A$3:$B$36,2,0),0)","v":0},null,null,null,null,null,null,0]
[null,null,{"$f":"IF(B253<>\"\",VLOOKUP(B253,'Tipo Projeto'!$A$3:$B$36,2,0),0)","v":0},null,null,null,null,null,null,0]
[null,null,{"$f":"IF(B254<>\"\",VLOOKUP(B254,'Tipo Projeto'!$A$3:$B$36,2,0),0)","v":0},null,null,null,null,null,null,0]
[null,null,{"$f":"IF(B255<>\"\",VLOOKUP(B255,'Tipo Projeto'!$A$3:$B$36,2,0),0)","v":0},null,null,null,null,null,null,0]
[null,null,{"$f":"IF(B256<>\"\",VLOOKUP(B256,'Tipo Projeto'!$A$3:$B$36,2,0),0)","v":0},null,null,null,null,null,null,0]
[null,null,{"$f":"IF(B257<>\"\",VLOOKUP(B257,'Tipo Projeto'!$A$3:$B$36,2,0),0)","v":0},null,null,null,null,null,null,0]
[null,null,{"$f":"IF(B258<>\"\",VLOOKUP(B258,'Tipo Projeto'!$A$3:$B$36,2,0),0)","v":0},null,null,null,null,null,null,0]
[null,null,{"$f":"IF(B259<>\"\",VLOOKUP(B259,'Tipo Projeto'!$A$3:$B$36,2,0),0)","v":0},null,null,null,null,null,null,0]
[null,null,{"$f":"IF(B260<>\"\",VLOOKUP(B260,'Tipo Projeto'!$A$3:$B$36,2,0),0)","v":0},null,null,null,null,null,null,0]
[null,null,{"$f":"IF(B261<>\"\",VLOOKUP(B261,'Tipo Projeto'!$A$3:$B$36,2,0),0)","v":0},null,null,null,null,null,null,0]
[null,null,{"$f":"IF(B262<>\"\",VLOOKUP(B262,'Tipo Projeto'!$A$3:$B$36,2,0),0)","v":0},null,null,null,null,null,null,0]
[null,null,{"$f":"IF(B263<>\"\",VLOOKUP(B263,'Tipo Projeto'!$A$3:$B$36,2,0),0)","v":0},null,null,null,null,null,null,0]
[null,null,{"$f":"IF(B264<>\"\",VLOOKUP(B264,'Tipo Projeto'!$A$3:$B$36,2,0),0)","v":0},null,null,null,null,null,null,0]
[null,null,{"$f":"IF(B265<>\"\",VLOOKUP(B265,'Tipo Projeto'!$A$3:$B$36,2,0),0)","v":0},null,null,null,null,null,null,0]
[null,null,{"$f":"IF(B266<>\"\",VLOOKUP(B266,'Tipo Projeto'!$A$3:$B$36,2,0),0)","v":0},null,null,null,null,null,null,0]
[null,null,{"$f":"IF(B267<>\"\",VLOOKUP(B267,'Tipo Projeto'!$A$3:$B$36,2,0),0)","v":0},null,null,null,null,null,null,{"$f":"IF(B267<>\"Manutenção em interface\",IF(B267<>\"Desenv., Manutenção e Publicação de Páginas Estáticas\",IF(I267=\"EE\",4,IF(I267=\"CE\",4,IF(I267=\"SE\",5,IF(I267=\"ALI\",7,IF(I267=\"AIE\",5,0)))))*C267,C267),C267)","v":0}]
[null,null,{"$f":"IF(B268<>\"\",VLOOKUP(B268,'Tipo Projeto'!$A$3:$B$36,2,0),0)","v":0},null,null,null,null,null,null,0]
[null,null,{"$f":"IF(B269<>\"\",VLOOKUP(B269,'Tipo Projeto'!$A$3:$B$36,2,0),0)","v":0},null,null,null,null,null,null,0]
[null,null,{"$f":"IF(B270<>\"\",VLOOKUP(B270,'Tipo Projeto'!$A$3:$B$36,2,0),0)","v":0},null,null,null,null,null,null,0]
[null,null,{"$f":"IF(B271<>\"\",VLOOKUP(B271,'Tipo Projeto'!$A$3:$B$36,2,0),0)","v":0},null,null,null,null,null,null,0]
[null,null,{"$f":"IF(B272<>\"\",VLOOKUP(B272,'Tipo Projeto'!$A$3:$B$36,2,0),0)","v":0},null,null,null,null,null,null,0]
[null,null,{"$f":"IF(B273<>\"\",VLOOKUP(B273,'Tipo Projeto'!$A$3:$B$36,2,0),0)","v":0},null,null,null,null,null,null,0]
[null,null,{"$f":"IF(B274<>\"\",VLOOKUP(B274,'Tipo Projeto'!$A$3:$B$36,2,0),0)","v":0},null,null,null,null,null,null,0]
[null,null,{"$f":"IF(B275<>\"\",VLOOKUP(B275,'Tipo Projeto'!$A$3:$B$36,2,0),0)","v":0},null,null,null,null,null,null,0]
[null,null,{"$f":"IF(B276<>\"\",VLOOKUP(B276,'Tipo Projeto'!$A$3:$B$36,2,0),0)","v":0},null,null,null,null,null,null,0]
[null,null,{"$f":"IF(B277<>\"\",VLOOKUP(B277,'Tipo Projeto'!$A$3:$B$36,2,0),0)","v":0},null,null,null,null,null,null,0]
[null,null,{"$f":"IF(B278<>\"\",VLOOKUP(B278,'Tipo Projeto'!$A$3:$B$36,2,0),0)","v":0},null,null,null,null,null,null,0]
[null,null,{"$f":"IF(B279<>\"\",VLOOKUP(B279,'Tipo Projeto'!$A$3:$B$36,2,0),0)","v":0},null,null,null,null,null,null,0]
[null,null,{"$f":"IF(B280<>\"\",VLOOKUP(B280,'Tipo Projeto'!$A$3:$B$36,2,0),0)","v":0},null,null,null,null,null,null,0]
[null,null,{"$f":"IF(B281<>\"\",VLOOKUP(B281,'Tipo Projeto'!$A$3:$B$36,2,0),0)","v":0},null,null,null,null,null,null,0]
[null,null,{"$f":"IF(B282<>\"\",VLOOKUP(B282,'Tipo Projeto'!$A$3:$B$36,2,0),0)","v":0},null,null,null,null,null,null,0]
[null,null,{"$f":"IF(B283<>\"\",VLOOKUP(B283,'Tipo Projeto'!$A$3:$B$36,2,0),0)","v":0},null,null,null,null,null,null,0]
[null,null,{"$f":"IF(B284<>\"\",VLOOKUP(B284,'Tipo Projeto'!$A$3:$B$36,2,0),0)","v":0},null,null,null,null,null,null,0]
[null,null,{"$f":"IF(B285<>\"\",VLOOKUP(B285,'Tipo Projeto'!$A$3:$B$36,2,0),0)","v":0},null,null,null,null,null,null,0]
[null,null,{"$f":"IF(B286<>\"\",VLOOKUP(B286,'Tipo Projeto'!$A$3:$B$36,2,0),0)","v":0},null,null,null,null,null,null,0]
[null,null,{"$f":"IF(B287<>\"\",VLOOKUP(B287,'Tipo Projeto'!$A$3:$B$36,2,0),0)","v":0},null,null,null,null,null,null,0]
[null,null,{"$f":"IF(B288<>\"\",VLOOKUP(B288,'Tipo Projeto'!$A$3:$B$36,2,0),0)","v":0},null,null,null,null,null,null,0]
[null,null,{"$f":"IF(B289<>\"\",VLOOKUP(B289,'Tipo Projeto'!$A$3:$B$36,2,0),0)","v":0},null,null,null,null,null,null,0]
[null,null,{"$f":"IF(B290<>\"\",VLOOKUP(B290,'Tipo Projeto'!$A$3:$B$36,2,0),0)","v":0},null,null,null,null,null,null,0]
[null,null,{"$f":"IF(B291<>\"\",VLOOKUP(B291,'Tipo Projeto'!$A$3:$B$36,2,0),0)","v":0},null,null,null,null,null,null,0]
[null,null,{"$f":"IF(B292<>\"\",VLOOKUP(B292,'Tipo Projeto'!$A$3:$B$36,2,0),0)","v":0},null,null,null,null,null,null,0]
[null,null,{"$f":"IF(B293<>\"\",VLOOKUP(B293,'Tipo Projeto'!$A$3:$B$36,2,0),0)","v":0},null,null,null,null,null,null,0]
[null,null,{"$f":"IF(B294<>\"\",VLOOKUP(B294,'Tipo Projeto'!$A$3:$B$36,2,0),0)","v":0},null,null,null,null,null,null,0]
[null,null,{"$f":"IF(B295<>\"\",VLOOKUP(B295,'Tipo Projeto'!$A$3:$B$36,2,0),0)","v":0},null,null,null,null,null,null,0]
[null,null,{"$f":"IF(B296<>\"\",VLOOKUP(B296,'Tipo Projeto'!$A$3:$B$36,2,0),0)","v":0},null,null,null,null,null,null,0]
[null,null,{"$f":"IF(B297<>\"\",VLOOKUP(B297,'Tipo Projeto'!$A$3:$B$36,2,0),0)","v":0},null,null,null,null,null,null,0]
[null,null,{"$f":"IF(B298<>\"\",VLOOKUP(B298,'Tipo Projeto'!$A$3:$B$36,2,0),0)","v":0},null,null,null,null,null,null,0]
[null,null,{"$f":"IF(B299<>\"\",VLOOKUP(B299,'Tipo Projeto'!$A$3:$B$36,2,0),0)","v":0},null,null,null,null,null,null,0]
[null,null,{"$f":"IF(B300<>\"\",VLOOKUP(B300,'Tipo Projeto'!$A$3:$B$36,2,0),0)","v":0},null,null,null,null,null,null,0]
[null,null,{"$f":"IF(B301<>\"\",VLOOKUP(B301,'Tipo Projeto'!$A$3:$B$36,2,0),0)","v":0},null,null,null,null,null,null,0]
[null,null,{"$f":"IF(B302<>\"\",VLOOKUP(B302,'Tipo Projeto'!$A$3:$B$36,2,0),0)","v":0},null,null,null,null,null,null,0]
[null,null,{"$f":"IF(B303<>\"\",VLOOKUP(B303,'Tipo Projeto'!$A$3:$B$36,2,0),0)","v":0},null,null,null,null,null,null,0]
[null,null,{"$f":"IF(B304<>\"\",VLOOKUP(B304,'Tipo Projeto'!$A$3:$B$36,2,0),0)","v":0},null,null,null,null,null,null,0]
[null,null,{"$f":"IF(B305<>\"\",VLOOKUP(B305,'Tipo Projeto'!$A$3:$B$36,2,0),0)","v":0},null,null,null,null,null,null,0]
[null,null,{"$f":"IF(B306<>\"\",VLOOKUP(B306,'Tipo Projeto'!$A$3:$B$36,2,0),0)","v":0},null,null,null,null,null,null,0]
[null,null,{"$f":"IF(B307<>\"\",VLOOKUP(B307,'Tipo Projeto'!$A$3:$B$36,2,0),0)","v":0},null,null,null,null,null,null,0]
[null,null,{"$f":"IF(B308<>\"\",VLOOKUP(B308,'Tipo Projeto'!$A$3:$B$36,2,0),0)","v":0},null,null,null,null,null,null,0]
[null,null,{"$f":"IF(B309<>\"\",VLOOKUP(B309,'Tipo Projeto'!$A$3:$B$36,2,0),0)","v":0},null,null,null,null,null,null,0]
[null,null,{"$f":"IF(B310<>\"\",VLOOKUP(B310,'Tipo Projeto'!$A$3:$B$36,2,0),0)","v":0},null,null,null,null,null,null,0]
[null,null,{"$f":"IF(B311<>\"\",VLOOKUP(B311,'Tipo Projeto'!$A$3:$B$36,2,0),0)","v":0},null,null,null,null,null,null,0]
[null,null,{"$f":"IF(B312<>\"\",VLOOKUP(B312,'Tipo Projeto'!$A$3:$B$36,2,0),0)","v":0},null,null,null,null,null,null,0]
[null,null,{"$f":"IF(B313<>\"\",VLOOKUP(B313,'Tipo Projeto'!$A$3:$B$36,2,0),0)","v":0},null,null,null,null,null,null,0]
[null,null,{"$f":"IF(B314<>\"\",VLOOKUP(B314,'Tipo Projeto'!$A$3:$B$36,2,0),0)","v":0},null,null,null,null,null,null,0]
[null,null,{"$f":"IF(B315<>\"\",VLOOKUP(B315,'Tipo Projeto'!$A$3:$B$36,2,0),0)","v":0},null,null,null,null,null,null,0]
[null,null,{"$f":"IF(B316<>\"\",VLOOKUP(B316,'Tipo Projeto'!$A$3:$B$36,2,0),0)","v":0},null,null,null,null,null,null,0]
[null,null,{"$f":"IF(B317<>\"\",VLOOKUP(B317,'Tipo Projeto'!$A$3:$B$36,2,0),0)","v":0},null,null,null,null,null,null,0]
[null,null,{"$f":"IF(B318<>\"\",VLOOKUP(B318,'Tipo Projeto'!$A$3:$B$36,2,0),0)","v":0},null,null,null,null,null,null,0]
[null,null,{"$f":"IF(B319<>\"\",VLOOKUP(B319,'Tipo Projeto'!$A$3:$B$36,2,0),0)","v":0},null,null,null,null,null,null,0]
[null,null,{"$f":"IF(B320<>\"\",VLOOKUP(B320,'Tipo Projeto'!$A$3:$B$36,2,0),0)","v":0},null,null,null,null,null,null,0]
[null,null,{"$f":"IF(B321<>\"\",VLOOKUP(B321,'Tipo Projeto'!$A$3:$B$36,2,0),0)","v":0},null,null,null,null,null,null,0]
[null,null,{"$f":"IF(B322<>\"\",VLOOKUP(B322,'Tipo Projeto'!$A$3:$B$36,2,0),0)","v":0},null,null,null,null,null,null,0]
[null,null,{"$f":"IF(B323<>\"\",VLOOKUP(B323,'Tipo Projeto'!$A$3:$B$36,2,0),0)","v":0},null,null,null,null,null,null,0]
[null,null,{"$f":"IF(B324<>\"\",VLOOKUP(B324,'Tipo Projeto'!$A$3:$B$36,2,0),0)","v":0},null,null,null,null,null,null,0]
[null,null,{"$f":"IF(B325<>\"\",VLOOKUP(B325,'Tipo Projeto'!$A$3:$B$36,2,0),0)","v":0},null,null,null,null,null,null,0]
[null,null,{"$f":"IF(B326<>\"\",VLOOKUP(B326,'Tipo Projeto'!$A$3:$B$36,2,0),0)","v":0},null,null,null,null,null,null,0]
[null,null,{"$f":"IF(B327<>\"\",VLOOKUP(B327,'Tipo Projeto'!$A$3:$B$36,2,0),0)","v":0},null,null,null,null,null,null,0]
[null,null,{"$f":"IF(B328<>\"\",VLOOKUP(B328,'Tipo Projeto'!$A$3:$B$36,2,0),0)","v":0},null,null,null,null,null,null,0]
[null,null,{"$f":"IF(B329<>\"\",VLOOKUP(B329,'Tipo Projeto'!$A$3:$B$36,2,0),0)","v":0},null,null,null,null,null,null,0]
[null,null,{"$f":"IF(B330<>\"\",VLOOKUP(B330,'Tipo Projeto'!$A$3:$B$36,2,0),0)","v":0},null,null,null,null,null,null,0]
[null,null,{"$f":"IF(B331<>\"\",VLOOKUP(B331,'Tipo Projeto'!$A$3:$B$36,2,0),0)","v":0},null,null,null,null,null,null,{"$f":"IF(B331<>\"Manutenção em interface\",IF(B331<>\"Desenv., Manutenção e Publicação de Páginas Estáticas\",IF(I331=\"EE\",4,IF(I331=\"CE\",4,IF(I331=\"SE\",5,IF(I331=\"ALI\",7,IF(I331=\"AIE\",5,0)))))*C331,C331),C331)","v":0}]
[null,null,{"$f":"IF(B332<>\"\",VLOOKUP(B332,'Tipo Projeto'!$A$3:$B$36,2,0),0)","v":0},null,null,null,null,null,null,0]
[null,null,{"$f":"IF(B333<>\"\",VLOOKUP(B333,'Tipo Projeto'!$A$3:$B$36,2,0),0)","v":0},null,null,null,null,null,null,0]
[null,null,{"$f":"IF(B334<>\"\",VLOOKUP(B334,'Tipo Projeto'!$A$3:$B$36,2,0),0)","v":0},null,null,null,null,null,null,0]
[null,null,{"$f":"IF(B335<>\"\",VLOOKUP(B335,'Tipo Projeto'!$A$3:$B$36,2,0),0)","v":0},null,null,null,null,null,null,0]
[null,null,{"$f":"IF(B336<>\"\",VLOOKUP(B336,'Tipo Projeto'!$A$3:$B$36,2,0),0)","v":0},null,null,null,null,null,null,0]
[null,null,{"$f":"IF(B337<>\"\",VLOOKUP(B337,'Tipo Projeto'!$A$3:$B$36,2,0),0)","v":0},null,null,null,null,null,null,0]
[null,null,{"$f":"IF(B338<>\"\",VLOOKUP(B338,'Tipo Projeto'!$A$3:$B$36,2,0),0)","v":0},null,null,null,null,null,null,0]
[null,null,{"$f":"IF(B339<>\"\",VLOOKUP(B339,'Tipo Projeto'!$A$3:$B$36,2,0),0)","v":0},null,null,null,null,null,null,0]
[null,null,{"$f":"IF(B340<>\"\",VLOOKUP(B340,'Tipo Projeto'!$A$3:$B$36,2,0),0)","v":0},null,null,null,null,null,null,0]
[null,null,{"$f":"IF(B341<>\"\",VLOOKUP(B341,'Tipo Projeto'!$A$3:$B$36,2,0),0)","v":0},null,null,null,null,null,null,0]
[null,null,{"$f":"IF(B342<>\"\",VLOOKUP(B342,'Tipo Projeto'!$A$3:$B$36,2,0),0)","v":0},null,null,null,null,null,null,0]
[null,null,{"$f":"IF(B343<>\"\",VLOOKUP(B343,'Tipo Projeto'!$A$3:$B$36,2,0),0)","v":0},null,null,null,null,null,null,0]
[null,null,{"$f":"IF(B344<>\"\",VLOOKUP(B344,'Tipo Projeto'!$A$3:$B$36,2,0),0)","v":0},null,null,null,null,null,null,0]
[null,null,{"$f":"IF(B345<>\"\",VLOOKUP(B345,'Tipo Projeto'!$A$3:$B$36,2,0),0)","v":0},null,null,null,null,null,null,0]
[null,null,{"$f":"IF(B346<>\"\",VLOOKUP(B346,'Tipo Projeto'!$A$3:$B$36,2,0),0)","v":0},null,null,null,null,null,null,0]
[null,null,{"$f":"IF(B347<>\"\",VLOOKUP(B347,'Tipo Projeto'!$A$3:$B$36,2,0),0)","v":0},null,null,null,null,null,null,0]
[null,null,{"$f":"IF(B348<>\"\",VLOOKUP(B348,'Tipo Projeto'!$A$3:$B$36,2,0),0)","v":0},null,null,null,null,null,null,0]
[null,null,{"$f":"IF(B349<>\"\",VLOOKUP(B349,'Tipo Projeto'!$A$3:$B$36,2,0),0)","v":0},null,null,null,null,null,null,0]
[null,null,{"$f":"IF(B350<>\"\",VLOOKUP(B350,'Tipo Projeto'!$A$3:$B$36,2,0),0)","v":0},null,null,null,null,null,null,0]
[null,null,{"$f":"IF(B351<>\"\",VLOOKUP(B351,'Tipo Projeto'!$A$3:$B$36,2,0),0)","v":0},null,null,null,null,null,null,0]
[null,null,{"$f":"IF(B352<>\"\",VLOOKUP(B352,'Tipo Projeto'!$A$3:$B$36,2,0),0)","v":0},null,null,null,null,null,null,0]
[null,null,{"$f":"IF(B353<>\"\",VLOOKUP(B353,'Tipo Projeto'!$A$3:$B$36,2,0),0)","v":0},null,null,null,null,null,null,0]
[null,null,{"$f":"IF(B354<>\"\",VLOOKUP(B354,'Tipo Projeto'!$A$3:$B$36,2,0),0)","v":0},null,null,null,null,null,null,0]
[null,null,{"$f":"IF(B355<>\"\",VLOOKUP(B355,'Tipo Projeto'!$A$3:$B$36,2,0),0)","v":0},null,null,null,null,null,null,0]
[null,null,{"$f":"IF(B356<>\"\",VLOOKUP(B356,'Tipo Projeto'!$A$3:$B$36,2,0),0)","v":0},null,null,null,null,null,null,0]
[null,null,{"$f":"IF(B357<>\"\",VLOOKUP(B357,'Tipo Projeto'!$A$3:$B$36,2,0),0)","v":0},null,null,null,null,null,null,0]
[null,null,{"$f":"IF(B358<>\"\",VLOOKUP(B358,'Tipo Projeto'!$A$3:$B$36,2,0),0)","v":0},null,null,null,null,null,null,0]
[null,null,{"$f":"IF(B359<>\"\",VLOOKUP(B359,'Tipo Projeto'!$A$3:$B$36,2,0),0)","v":0},null,null,null,null,null,null,0]
[null,null,{"$f":"IF(B360<>\"\",VLOOKUP(B360,'Tipo Projeto'!$A$3:$B$36,2,0),0)","v":0},null,null,null,null,null,null,0]
[null,null,{"$f":"IF(B361<>\"\",VLOOKUP(B361,'Tipo Projeto'!$A$3:$B$36,2,0),0)","v":0},null,null,null,null,null,null,0]
[null,null,{"$f":"IF(B362<>\"\",VLOOKUP(B362,'Tipo Projeto'!$A$3:$B$36,2,0),0)","v":0},null,null,null,null,null,null,0]
[null,null,{"$f":"IF(B363<>\"\",VLOOKUP(B363,'Tipo Projeto'!$A$3:$B$36,2,0),0)","v":0},null,null,null,null,null,null,0]
[null,null,{"$f":"IF(B364<>\"\",VLOOKUP(B364,'Tipo Projeto'!$A$3:$B$36,2,0),0)","v":0},null,null,null,null,null,null,0]
[null,null,{"$f":"IF(B365<>\"\",VLOOKUP(B365,'Tipo Projeto'!$A$3:$B$36,2,0),0)","v":0},null,null,null,null,null,null,0]
[null,null,{"$f":"IF(B366<>\"\",VLOOKUP(B366,'Tipo Projeto'!$A$3:$B$36,2,0),0)","v":0},null,null,null,null,null,null,0]
[null,null,{"$f":"IF(B367<>\"\",VLOOKUP(B367,'Tipo Projeto'!$A$3:$B$36,2,0),0)","v":0},null,null,null,null,null,null,0]
[null,null,{"$f":"IF(B368<>\"\",VLOOKUP(B368,'Tipo Projeto'!$A$3:$B$36,2,0),0)","v":0},null,null,null,null,null,null,0]
[null,null,{"$f":"IF(B369<>\"\",VLOOKUP(B369,'Tipo Projeto'!$A$3:$B$36,2,0),0)","v":0},null,null,null,null,null,null,0]
[null,null,{"$f":"IF(B370<>\"\",VLOOKUP(B370,'Tipo Projeto'!$A$3:$B$36,2,0),0)","v":0},null,null,null,null,null,null,0]
[null,null,{"$f":"IF(B371<>\"\",VLOOKUP(B371,'Tipo Projeto'!$A$3:$B$36,2,0),0)","v":0},null,null,null,null,null,null,0]
[null,null,{"$f":"IF(B372<>\"\",VLOOKUP(B372,'Tipo Projeto'!$A$3:$B$36,2,0),0)","v":0},null,null,null,null,null,null,0]
[null,null,{"$f":"IF(B373<>\"\",VLOOKUP(B373,'Tipo Projeto'!$A$3:$B$36,2,0),0)","v":0},null,null,null,null,null,null,0]
[null,null,{"$f":"IF(B374<>\"\",VLOOKUP(B374,'Tipo Projeto'!$A$3:$B$36,2,0),0)","v":0},null,null,null,null,null,null,0]
[null,null,{"$f":"IF(B375<>\"\",VLOOKUP(B375,'Tipo Projeto'!$A$3:$B$36,2,0),0)","v":0},null,null,null,null,null,null,0]
[null,null,{"$f":"IF(B376<>\"\",VLOOKUP(B376,'Tipo Projeto'!$A$3:$B$36,2,0),0)","v":0},null,null,null,null,null,null,0]
[null,null,{"$f":"IF(B377<>\"\",VLOOKUP(B377,'Tipo Projeto'!$A$3:$B$36,2,0),0)","v":0},null,null,null,null,null,null,0]
[null,null,{"$f":"IF(B378<>\"\",VLOOKUP(B378,'Tipo Projeto'!$A$3:$B$36,2,0),0)","v":0},null,null,null,null,null,null,0]
[null,null,{"$f":"IF(B379<>\"\",VLOOKUP(B379,'Tipo Projeto'!$A$3:$B$36,2,0),0)","v":0},null,null,null,null,null,null,0]
[null,null,{"$f":"IF(B380<>\"\",VLOOKUP(B380,'Tipo Projeto'!$A$3:$B$36,2,0),0)","v":0},null,null,null,null,null,null,0]
[null,null,{"$f":"IF(B381<>\"\",VLOOKUP(B381,'Tipo Projeto'!$A$3:$B$36,2,0),0)","v":0},null,null,null,null,null,null,0]
[null,null,{"$f":"IF(B382<>\"\",VLOOKUP(B382,'Tipo Projeto'!$A$3:$B$36,2,0),0)","v":0},null,null,null,null,null,null,0]
["Só inserir linhas antes desta."]
[null,null,null,null,null,null,null,"Tamanho Funcional Estimado:",null,{"$f":"SUM(J10:J383)","v":0}]

{"sheet":"AFP - Indicativa","index":4,"n_rows":110,"n_cols":10,"rows_kept":110,"cut":false,"hidden":false,"merged":[[108,0,108,9],[106,4,106,5],[107,4,107,5],[0,4,0,9],[2,7,2,9],[3,7,3,9],[4,7,4,9],[5,7,5,9],[100,4,100,5],[101,4,101,5],[102,4,102,5],[103,4,103,5],[104,4,104,5],[105,4,105,5],[94,4,94,5],[95,4,95,5],[96,4,96,5],[97,4,97,5],[98,4,98,5],[99,4,99,5],[88,4,88,5],[89,4,89,5],[90,4,90,5],[91,4,91,5],[92,4,92,5],[93,4,93,5],[82,4,82,5],[83,4,83,5],[84,4,84,5],[85,4,85,5],[86,4,86,5],[87,4,87,5],[76,4,76,5],[77,4,77,5],[78,4,78,5],[79,4,79,5],[80,4,80,5],[81,4,81,5],[70,4,70,5],[71,4,71,5],[72,4,72,5],[73,4,73,5],[74,4,74,5],[75,4,75,5],[64,4,64,5],[65,4,65,5],[66,4,66,5],[67,4,67,5],[68,4,68,5],[69,4,69,5],[58,4,58,5],[59,4,59,5],[60,4,60,5],[61,4,61,5],[62,4,62,5],[63,4,63,5],[52,4,52,5],[53,4,53,5],[54,4,54,5],[55,4,55,5],[56,4,56,5],[57,4,57,5],[32,4,32,5],[33,4,33,5],[46,4,46,5],[47,4,47,5],[48,4,48,5],[49,4,49,5],[50,4,50,5],[51,4,51,5],[40,4,40,5],[41,4,41,5],[42,4,42,5],[43,4,43,5],[44,4,44,5],[45,4,45,5],[4,0,5,3],[4,4,5,4],[7,4,8,5],[22,4,22,5],[23,4,23,5],[24,4,24,5],[25,4,25,5],[26,4,26,5],[16,4,16,5],[17,4,17,5],[18,4,18,5],[19,4,19,5],[20,4,20,5],[21,4,21,5],[9,0,9,9],[7,9,8,9],[109,6,109,7],[7,0,8,0],[7,1,8,1],[7,2,8,2],[7,3,8,3],[7,6,8,6],[7,7,7,8],[10,4,10,5],[11,4,11,5],[12,4,12,5],[13,4,13,5],[14,4,14,5],[15,4,15,5],[27,4,27,5],[34,4,34,5],[35,4,35,5],[36,4,36,5],[37,4,37,5],[38,4,38,5],[39,4,39,5],[28,4,28,5],[29,4,29,5],[30,4,30,5],[31,4,31,5]]}
["Template V.1.1",null,null,null,"Contagem de Pontos de Função - SISP 2.0\nContagem Indicativa"]
[]
[null,null,null,null,null,null,"Elaborador da contagem:"]
[null,null,null,null,null,null,"Data da Contagem:"]
["Quantidade de Pontos de Função:",null,null,null,{"$f":"TEXT(I110,\"#.##0,0#\")","v":"0,0"},null,"Revisor da contagem:"]
[null,null,null,null,null,null,"Data da Revisão:"]
[]
["ID","Item PT","Release","Módulo","Requisito",null,"Arquivos Lógicos","Desenvolvimento",null,"Fund."]
[null,null,null,null,null,null,null,"Tipo","PF"]
["Só inserir linhas depois desta."]
[null,null,null,null,null,null,null,null,{"$f":"IF(H11=\"ALI\",35,IF(H11=\"AIE\",15,\"\"))","v":""}]
[null,null,null,null,null,null,null,null,""]
[null,null,null,null,null,null,null,null,""]
[null,null,null,null,null,null,null,null,""]
[null,null,null,null,null,null,null,null,""]
[null,null,null,null,null,null,null,null,""]
[null,null,null,null,null,null,null,null,""]
[null,null,null,null,null,null,null,null,""]
[null,null,null,null,null,null,null,null,""]
[null,null,null,null,null,null,null,null,""]
[null,null,null,null,null,null,null,null,""]
[null,null,null,null,null,null,null,null,""]
[null,null,null,null,null,null,null,null,""]
[null,null,null,null,null,null,null,null,""]
[null,null,null,null,null,null,null,null,""]
[null,null,null,null,null,null,null,null,""]
[null,null,null,null,null,null,null,null,""]
[null,null,null,null,null,null,null,null,""]
[null,null,null,null,null,null,null,null,""]
[null,null,null,null,null,null,null,null,""]
[null,null,null,null,null,null,null,null,""]
[null,null,null,null,null,null,null,null,""]
[null,null,null,null,null,null,null,null,""]
[null,null,null,null,null,null,null,null,""]
[null,null,null,null,null,null,null,null,""]
[null,null,null,null,null,null,null,null,""]
[null,null,null,null,null,null,null,null,""]
[null,null,null,null,null,null,null,null,""]
[null,null,null,null,null,null,null,null,""]
[null,null,null,null,null,null,null,null,""]
[null,null,null,null,null,null,null,null,""]
[null,null,null,null,null,null,null,null,{"$f":"IF(H42=\"ALI\",35,IF(H42=\"AIE\",15,\"\"))","v":""}]
[null,null,null,null,null,null,null,null,""]
[null,null,null,null,null,null,null,null,""]
[null,null,null,null,null,null,null,null,""]
[null,null,null,null,null,null,null,null,""]
[null,null,null,null,null,null,null,null,""]
[null,null,null,null,null,null,null,null,""]
[null,null,null,null,null,null,null,null,""]
[null,null,null,null,null,null,null,null,""]
[null,null,null,null,null,null,null,null,""]
[null,null,null,null,null,null,null,null,""]
[null,null,null,null,null,null,null,null,""]
[null,null,null,null,null,null,null,null,""]
[null,null,null,null,null,null,null,null,""]
[null,null,null,null,null,null,null,null,""]
[null,null,null,null,null,null,null,null,""]
[null,null,null,null,null,null,null,null,""]
[null,null,null,null,null,null,null,null,""]
[null,null,null,null,null,null,null,null,""]
[null,null,null,null,null,null,null,null,""]
[null,null,null,null,null,null,null,null,""]
[null,null,null,null,null,null,null,null,""]
[null,null,null,null,null,null,null,null,""]
[null,null,null,null,null,null,null,null,""]
[null,null,null,null,null,null,null,null,""]
[null,null,null,null,null,null,null,null,""]
[null,null,null,null,null,null,null,null,""]
[null,null,null,null,null,null,null,null,""]
[null,null,null,null,null,null,null,null,""]
[null,null,null,null,null,null,null,null,""]
[null,null,null,null,null,null,null,null,""]
[null,null,null,null,null,null,null,null,""]
[null,null,null,null,null,null,null,null,{"$f":"IF(H74=\"ALI\",35,IF(H74=\"AIE\",15,\"\"))","v":""}]
[null,null,null,null,null,null,null,null,""]
[null,null,null,null,null,null,null,null,""]
[null,null,null,null,null,null,null,null,""]
[null,null,null,null,null,null,null,null,""]
[null,null,null,null,null,null,null,null,""]
[null,null,null,null,null,null,null,null,""]
[null,null,null,null,null,null,null,null,""]
[null,null,null,null,null,null,null,null,""]
[null,null,null,null,null,null,null,null,""]
[null,null,null,null,null,null,null,null,""]
[null,null,null,null,null,null,null,null,""]
[null,null,null,null,null,null,null,null,""]
[null,null,null,null,null,null,null,null,""]
[null,null,null,null,null,null,null,null,""]
[null,null,null,null,null,null,null,null,""]
[null,null,null,null,null,null,null,null,""]
[null,null,null,null,null,null,null,null,""]
[null,null,null,null,null,null,null,null,""]
[null,null,null,null,null,null,null,null,""]
[null,null,null,null,null,null,null,null,""]
[null,null,null,null,null,null,null,null,""]
[null,null,null,null,null,null,null,null,""]
[null,null,null,null,null,null,null,null,""]
[null,null,null,null,null,null,null,null,""]
[null,null,null,null,null,null,null,null,""]
[null,null,null,null,null,null,null,null,""]
[null,null,null,null,null,null,null,null,""]
[null,null,null,null,null,null,null,null,""]
[null,null,null,null,null,null,null,null,""]
[null,null,null,null,null,null,null,null,""]
[null,null,null,null,null,null,null,null,""]
[null,null,null,null,null,null,null,null,{"$f":"IF(H106=\"ALI\",35,IF(H106=\"AIE\",15,\"\"))","v":""}]
[null,null,null,null,null,null,null,null,{"$f":"IF(H107=\"ALI\",35,IF(H107=\"AIE\",15,\"\"))","v":""}]
[null,null,null,null,null,null,null,null,{"$f":"IF(H108=\"ALI\",35,IF(H108=\"AIE\",15,\"\"))","v":""}]
["Só inserir linhas antes desta."]
[null,null,null,null,null,null,"Tamanho Funcional Indicativo:",null,{"$f":"SUM(I10:I109)","v":0}]

{"sheet":"Fundamentação","index":5,"n_rows":6,"n_cols":3,"rows_kept":6,"cut":false,"hidden":false,"merged":[[2,0,2,2]]}
[{"$f":"Resumo!A1","v":"Template V.1.6"},null,"Contagem de Pontos de Função - SISP 2.0\nFundamentação"]
[]
["Fundamentação da Contagem"]
["ID","Título","Imagem Tela / Link documentação / Justificativa"]
[1]
[2]

{"sheet":"Redução de Prazo","index":6,"n_rows":115,"n_cols":19,"rows_kept":115,"cut":false,"hidden":false,"merged":[[0,3,0,17],[1,1,1,7],[2,1,2,5],[2,6,2,7],[3,1,3,5],[3,6,3,7],[4,6,5,6],[6,1,6,5],[6,6,6,7],[7,1,7,5],[7,6,7,7],[10,1,10,2],[8,1,9,2],[8,3,9,3],[8,4,9,4],[4,1,5,5],[11,1,11,2],[12,1,12,2],[13,1,13,2],[14,1,14,2],[15,1,15,2],[2,13,2,15],[2,16,2,17],[2,10,3,11],[2,9,4,9],[1,13,1,17],[1,9,1,11],[3,13,3,15],[3,16,3,17],[4,13,4,15],[4,16,4,17],[5,13,5,15],[5,16,5,17],[10,13,10,17],[7,13,7,15],[6,13,6,15],[16,5,16,7],[14,9,16,9],[14,10,16,11],[8,5,9,5],[8,6,8,7],[9,13,9,15],[8,13,8,15]]}
[null,{"$f":"Resumo!$A$1","v":"Template V.1.6"},null,"Contagem de Pontos de Função - SISP 2.0\nDistribuição de Esforço/ Redução de Prazo"]
[null,"DISTRIBUIÇÃO DE PRAZO DE PROJETO",null,null,null,null,null,null,null,{"$f":"IF(G4=\"SISP v1.0\",\"PRAZO SISP 1 ATÉ 99 PF\",\"PRAZO SISP 2/2.1 ATÉ 99 PF\")","v":"PRAZO SISP 2/2.1 ATÉ 99 PF"},null,null,null,"REDUÇÃO DE PRAZO"]
[null,"P1 - Informe o tipo de Prazo (Úteis/Corridos):",null,null,null,null,"Corridos",null,null,"Tamanho do Projeto",{"$f":"IF(G3=\"Úteis\", \"Prazo em dias úteis\",\"Prazo em dias corridos\")","v":"Prazo em dias corridos"},null,null,"DESCRIÇÃO",null,null,"VALORES"]
[null,"P2 - Informe a versão do SISP:",null,null,null,null,"SISP v2.0/2.1",null,null,null,null,null,null,"Data limite desejada"]
[null,"P3 - Informe Tipo do Sistema:",null,null,null,null,"Sistema OO","Expoent t para o Tipo:",null,null,"Complex.\nBaixa","Complex.\nMédia",null,"Prazo desejado p/conclusão (dias)",null,null,{"$f":"IF(AND(Q4<>\"\",B17<>0),(Q4-G11)+1,B17)","v":"Informe PF"}]
[null,null,null,null,null,null,null,{"$f":"IF(G5=\"Sistema Comum – Mainframe\", 0.33, IF(G5=\"Sistema Comum – WEB\", 0.35, IF(G5=\"Sistema OO\", 0.36, IF(G5=\"Sistema Cliente/Servidor (Alta complexidade)\", 0.37,IF(G5=\"Sistemas Gerenciais Complexos\", 0.39, IF(G5=\"Software Básico, Framework, Sistemas Comerciais\", 0.4, IF(G5=\"Software Militar *Exclusivo SISP v2.0\", 0.45, \"ERRO - Selecione o Tipo novamente\")))))))","v":0.36},null,"Até 10 PF",{"$f":"ROUND(IF(G3=\"Úteis\",IF(G4=\"SISP v1.0\",10,9),IF(G4=\"SISP v1.0\",10*(7/5),9*(7/5))),0)","v":13},{"$f":"ROUND(IF(G3=\"Úteis\",IF(G4=\"SISP v1.0\",10,15),IF(G4=\"SISP v1.0\",10*(7/5),15*(7/5))),0)","v":21},null,"Taxa de redução do prazo-projeto",null,null,{"$f":"IF(G8<>0,Q5/B17-1,\"-\")","v":"-"}]
[null,"P4 - Informe a complexidade do projeto:",null,null,null,null,"Projetos com até 99 PF - Complexidade Média ou Alta",null,null,"De 11 PF a 20 PF",{"$f":"ROUND(IF(G3=\"Úteis\",IF(G4=\"SISP v1.0\",20,18),IF(G4=\"SISP v1.0\",20*(7/5),18*(7/5))),0)","v":25},{"$f":"ROUND(IF(G3=\"Úteis\",IF(G4=\"SISP v1.0\",20,30),IF(G4=\"SISP v1.0\",20*(7/5),30*(7/5))),0)","v":42},null,null,null,null,"SISP","LINEAR"]
[null,"P5 - Informe o tamanho do Projeto em PF:",null,null,null,null,null,null,null,"De 21 PF a 30 PF",{"$f":"ROUND(IF(G3=\"Úteis\",IF(G4=\"SISP v1.0\",30,27),IF(G4=\"SISP v1.0\",30*(7/5),27*(7/5))),0)","v":38},{"$f":"ROUND(IF(G3=\"Úteis\",IF(G4=\"SISP v1.0\",30,45),IF(G4=\"SISP v1.0\",30*(7/5),45*(7/5))),0)","v":63},null,"Taxa de aumento de esforço",null,null,{"$f":"IF(Q5=B17,\"-\",GROWTH(R22:R24,Q22:Q24,Q6,1))","v":"-"},{"$f":"IF(Q5=B17,\"-\",TREND(R22:R24,Q22:Q24,Q6,0))","v":"-"}]
[null,"Fases do Projeto",null,"% SISP","% OS","Dias","Cronograma",null,null,"De 31 PF a 40 PF",{"$f":"ROUND(IF(G3=\"Úteis\",IF(G4=\"SISP v1.0\",40,36),IF(G4=\"SISP v1.0\",40*(7/5),36*(7/5))),0)","v":50},{"$f":"ROUND(IF(G3=\"Úteis\",IF(G4=\"SISP v1.0\",40,60),IF(G4=\"SISP v1.0\",40*(7/5),60*(7/5))),0)","v":84},null,"Índice multiplicador de esforço",null,null,{"$f":"IF(Q5=B17,\"-\",Q8/100+1)","v":"-"},{"$f":"IF(Q5=B17,\"-\",R8/100+1)","v":"-"}]
[null,null,null,null,null,null,"Início","Fim",null,"De 41 PF a 50 PF",{"$f":"ROUND(IF(G3=\"Úteis\",IF(G4=\"SISP v1.0\",50,45),IF(G4=\"SISP v1.0\",50*(7/5),45*(7/5))),0)","v":63},{"$f":"ROUND(IF(G3=\"Úteis\",IF(G4=\"SISP v1.0\",50,75),IF(G4=\"SISP v1.0\",50*(7/5),75*(7/5))),0)","v":105},null,"Novo Tamanho Funcional (PF)",null,null,{"$f":"IF(Q5=B17,\"-\",(Q8/100+1)*G8)","v":"-"},{"$f":"IF(Q5=B17,\"-\",(R8/100+1)*G8)","v":"-"}]
[null,"Engenharia de Requisitos",null,0.25,0.25,{"$f":"IF(ISERR($B$17*E11),\"ERRO\",$B$17*E11)","v":"ERRO"},null,{"$f":"IF(E11=\"\",G11,(IF(G11=\"\",\"-\",IF(ISERR(IF(AND((G11>=0),(G11<=2958465)),G11+(F11-1),\"-\")),\"-\",IF(AND((G11>=0),(G11<=2958465)),G11+(F11-1),\"-\")))))","v":"-"},null,"De 51 PF a 60 PF",{"$f":"ROUND(IF(G3=\"Úteis\",IF(G4=\"SISP v1.0\",60,54),IF(G4=\"SISP v1.0\",60*(7/5),54*(7/5))),0)","v":76},{"$f":"ROUND(IF(G3=\"Úteis\",IF(G4=\"SISP v1.0\",60,90),IF(G4=\"SISP v1.0\",60*(7/5),90*(7/5))),0)","v":126},null,"CRONOGRAMA COM REDUÇÃO DE PRAZO"]
[null,"Arquitetura & Design",null,{"$f":"IF(G4=\"SISP v1.0\",15%,10%)","v":0.1},0.1,{"$f":"IF(ISERR($B$17*E12),\"ERRO\",$B$17*E12)","v":"ERRO"},{"$f":"IF(AND((H11>=0),(H11<=2958465)),H11,\"-\")","v":"-"},{"$f":"IF(G12=\"\", \"-\",(IF(AND((G12>=0),(G12<=2958465)),G12+(F12),\"-\")))","v":"-"},null,"De 61 PF a 70 PF",{"$f":"ROUND(IF(G3=\"Úteis\",IF(G4=\"SISP v1.0\",70,63),IF(G4=\"SISP v1.0\",70*(7/5),63*(7/5))),0)","v":88},{"$f":"ROUND(IF(G3=\"Úteis\",IF(G4=\"SISP v1.0\",70,105),IF(G4=\"SISP v1.0\",70*(7/5),105*(7/5))),0)","v":147},null,"Fases do Projeto","% OS","Dias","Data Início","Data Fim"]
[null,"Implementação",null,0.4,0.4,"ERRO",{"$f":"IF(AND((H12>=0),(H12<=2958465)),H12,\"-\")","v":"-"},{"$f":"IF(G13=\"\", \"-\",(IF(AND((G13>=0),(G13<=2958465)),G13+(F13),\"-\")))","v":"-"},null,"De 71 PF a 85 PF",{"$f":"ROUND(IF(G3=\"Úteis\",IF(G4=\"SISP v1.0\",88,70),IF(G4=\"SISP v1.0\",88*(7/5),70*(7/5))),0)","v":98},{"$f":"ROUND(IF(G3=\"Úteis\",IF(G4=\"SISP v1.0\",88,110),IF(G4=\"SISP v1.0\",88*(7/5),110*(7/5))),0)","v":154},null,"Engenharia de Requisitos",{"$f":"E11","v":0.25},{"$f":"IF(Q5=B17,\"-\",IF(AND($G$8<>0,$G$11<>\"\"),$Q$5*O13,\"-\"))","v":"-"},{"$f":"IF(Q5=B17,\"-\",IF(G11=\"\",\"-\",G11))","v":"-"},{"$f":"IF(Q13<>\"-\",(IF(P13>1,((Q13+P13)-1),(Q13+P13))),\"-\")","v":"-"}]
[null,"Testes",null,{"$f":"IF(G4=\"SISP v1.0\",10%,15%)","v":0.15},0.15,"ERRO",{"$f":"IF(AND((H13>=0),(H13<=2958465)),H13,\"-\")","v":"-"},{"$f":"IF(G14=\"\", \"-\",(IF(AND((G14>=0),(G14<=2958465)),G14+(F14),\"-\")))","v":"-"},null,"De 86 PF a 99 PF",{"$f":"ROUND(IF(G3=\"Úteis\",IF(G4=\"SISP v1.0\",104,79),IF(G4=\"SISP v1.0\",104*(7/5),79*(7/5))),0)","v":111},{"$f":"ROUND(IF(G3=\"Úteis\",IF(G4=\"SISP v1.0\",104,110),IF(G4=\"SISP v1.0\",104*(7/5),110*(7/5))),0)","v":154},null,"Arquitetura & Design",0.1,{"$f":"IF(Q5=B17,\"-\",IF(AND($G$8<>0,$G$11<>\"\"),$Q$5*O14,\"-\"))","v":"-"},{"$f":"R13","v":"-"},{"$f":"IF(Q14<>\"-\",Q14+P14,\"-\")","v":"-"}]
[null,"Homologação",null,0.05,0.05,"ERRO",{"$f":"IF(AND((H14>=0),(H14<=2958465)),H14,\"-\")","v":"-"},{"$f":"IF(G15=\"\", \"-\",(IF(AND((G15>=0),(G15<=2958465)),G15+(F15),\"-\")))","v":"-"},null,"+ de 99 PF","Cálculo pela fórmula de Capers Jones: \nTd = V^t",null,null,"Implementação",0.4,{"$f":"IF(Q5=B17,\"-\",IF(AND($G$8<>0,$G$11<>\"\"),$Q$5*O15,\"-\"))","v":"-"},{"$f":"R14","v":"-"},"-"]
[null,"Implantação",null,0.05,0.05,"ERRO",{"$f":"IF(AND((H15>=0),(H15<=2958465)),H15,\"-\")","v":"-"},{"$f":"IF(G16=\"\", \"-\",(IF(AND((G16>=0),(G16<=2958465)),G16+(F16),\"-\")))","v":"-"},null,null,null,null,null,"Testes",0.15,{"$f":"IF(Q5=B17,\"-\",IF(AND($G$8<>0,$G$11<>\"\"),$Q$5*O16,\"-\"))","v":"-"},"-","-"]
[null,{"$f":"IF(G8=\"\",\"Informe PF\",IF(G7=\"Projetos com até 99 PF - Complexidade Baixa\",(IF(G8<=10,K6,IF(G8<=20,K7,IF(G8<=30,K8,IF(G8<=40,K9,IF(G8<=50,K10,IF(G8<=60,K11,IF(G8<=70,K12,IF(G8<=85,K13,IF(G8<=99,K14,\"ERRO - Insira novamente o tamanho em PF do projeto\")))))))))),(IF(G7=\"Projetos com até 99 PF - Complexidade Média ou Alta\",(IF(G8<=10,L6,IF(G8<=20,L7,IF(G8<=30,L8,IF(G8<=40,L9,IF(G8<=50,L10,IF(G8<=60,L11,IF(G8<=70,L12,IF(G8<=99,L13,\"ERRO - Insira novamente o tamanho em PF do projeto\"))))))))),(IF(G8<=99,\"ERRO - Insira novamente o tamanho em PF do projeto\",ROUND(POWER(G8, IF(H6<>0,H6,0.35))*30, 0)))))))","v":"Informe PF"},"TOTAL",1,{"$f":"SUM(E11:E16)","v":1},{"$f":"IF(B17<>\"ERRO - Insira novamente o tamanho em PF do projeto\",SUM(F11:F16)&\" dias\",\"ERRO - Insira novamente PF\")","v":"0 dias"},null,null,null,null,null,null,null,"Homologação",0.05,{"$f":"IF(Q5=B17,\"-\",IF(AND($G$8<>0,$G$11<>\"\"),$Q$5*O17,\"-\"))","v":"-"},"-","-"]
[null,null,null,null,null,null,null,null,null,null,null,null,null,"Implantação",0.05,{"$f":"IF(Q5=B17,\"-\",IF(AND($G$8<>0,$G$11<>\"\"),$Q$5*O18,\"-\"))","v":"-"},"-","-"]
[]
[]
[null,null,null,null,null,null,null,null,null,null,null,null,null,null,null,null,"Redução \ndo prazo","Aumento\nno esforço"]
[null,null,null,null,null,null,null,null,null,null,null,null,null,null,null,null,-0.1,20]
[null,null,null,null,null,null,null,null,null,null,null,null,null,null,null,null,-0.2,50]
[null,null,null,null,null,null,null,null,null,null,null,null,null,null,null,null,-0.25,70]
[]
[null,null,null,null,null,null,null,null,null,null,null,null,null,null,null,null,"Redução do prazo","SISP","Curva\nLinear"]
[null,null,null,null,null,null,null,null,null,null,null,null,null,null,null,null,-0.01,{"$f":"GROWTH($R$22:$R$24,$Q$22:$Q$24,Q27,1)","v":9.4974870513428584},{"$f":"TREND($R$22:$R$24,$Q$22:$Q$24,Q27,0)","v":2.6222222222222218}]
[null,null,null,null,null,null,null,null,null,null,null,null,null,null,null,null,-0.02,10.336729939663668,5.2444444444444436]
[null,null,null,null,null,null,null,null,null,null,null,null,null,null,null,null,-0.03,11.25013230004161,7.8666666666666645]
[null,null,null,null,null,null,null,null,null,null,null,null,null,null,null,null,-0.04,12.244247214274969,10.488888888888887]
[null,null,null,null,null,null,null,null,null,null,null,null,null,null,null,null,-0.05,13.32620682547225,13.111111111111109]
[null,null,null,null,null,null,null,null,null,null,null,null,null,null,null,null,-0.06,14.503773506649086,15.733333333333329]
[null,null,null,null,null,null,null,null,null,null,null,null,null,null,null,null,-7.0000000000000007E-2,15.785395550824445,18.355555555555554]
[null,null,null,null,null,null,null,null,null,null,null,null,null,null,null,null,-0.08,17.180267782157173,20.977777777777774]
[null,null,null,null,null,null,null,null,null,null,null,null,null,null,null,null,-0.09,18.69839752296939,23.599999999999994]
[null,null,null,null,null,null,null,null,null,null,null,null,null,null,null,null,-0.1,20.350676389928065,26.222222222222218]
[null,null,null,null,null,null,null,null,null,null,null,null,null,null,null,null,-0.11,22.148958434476945,28.844444444444438]
[null,null,null,null,null,null,null,null,null,null,null,null,null,null,null,null,-0.12,24.106145188126657,31.466666666666658]
[null,null,null,null,null,null,null,null,null,null,null,null,null,null,null,null,-0.13,26.236278222749089,34.088888888888881]
[null,null,null,null,null,null,null,null,null,null,null,null,null,null,null,null,-0.14000000000000001,28.554639889937153,36.711111111111109]
[null,null,null,null,null,null,null,null,null,null,null,null,null,null,null,null,-0.15,31.077862962171093,39.333333333333321]
[null,null,null,null,null,null,null,null,null,null,null,null,null,null,null,null,-0.16,33.824049962396906,41.955555555555549]
[null,null,null,null,null,null,null,null,null,null,null,null,null,null,null,null,-0.17,36.812903038130841,44.577777777777776]
[null,null,null,null,null,null,null,null,null,null,null,null,null,null,null,null,-0.18,40.065865311854225,47.199999999999989]
[null,null,null,null,null,null,null,null,null,null,null,null,null,null,null,null,-0.19,43.606274721797959,49.822222222222216]
[null,null,null,null,null,null,null,null,null,null,null,null,null,null,null,null,-0.2,50,52.444444444444436]
[null,null,null,null,null,null,null,null,null,null,null,null,null,null,null,null,-0.21,{"$f":"GROWTH($R$22:$R$24,$Q$22:$Q$24,Q47,1)","v":51.653280186659927},55.066666666666656]
[null,null,null,null,null,null,null,null,null,null,null,null,null,null,null,null,-0.22,{"$f":"GROWTH($R$22:$R$24,$Q$22:$Q$24,Q48,1)","v":56.217608394821809},57.688888888888876]
[null,null,null,null,null,null,null,null,null,null,null,null,null,null,null,null,-0.23,{"$f":"GROWTH($R$22:$R$24,$Q$22:$Q$24,Q49,1)","v":61.18526223722295},60.311111111111103]
[null,null,null,null,null,null,null,null,null,null,null,null,null,null,null,null,-0.24,{"$f":"GROWTH($R$22:$R$24,$Q$22:$Q$24,Q50,1)","v":66.591881475032011},62.933333333333316]
[null,null,null,null,null,null,null,null,null,null,null,null,null,null,null,null,-0.25,70,65.555555555555543]
[null,null,null,null,null,null,null,null,null,null,null,null,null,null,null,null,-0.26,{"$f":"GROWTH($R$22:$R$24,$Q$22:$Q$24,Q52,1)","v":78.880599957951503},68.177777777777763]
[null,null,null,null,null,null,null,null,null,null,null,null,null,null,null,null,-0.27,85.850862953132875,70.8]
[null,null,null,null,null,null,null,null,null,null,null,null,null,null,null,null,-0.28000000000000003,93.437051362774795,73.422222222222217]
[null,null,null,null,null,null,null,null,null,null,null,null,null,null,null,null,-0.28999999999999998,101.69359127043245,76.044444444444423]
[null,null,null,null,null,null,null,null,null,null,null,null,null,null,null,null,-0.3,110.67971810589327,78.666666666666643]
[null,null,null,null,null,null,null,null,null,null,null,null,null,null,null,null,-0.31,120.45990162176226,81.288888888888877]
[null,null,null,null,null,null,null,null,null,null,null,null,null,null,null,null,-0.32,131.10430842299021,83.911111111111097]
[null,null,null,null,null,null,null,null,null,null,null,null,null,null,null,null,-0.33,142.68930536769835,{"$f":"TREND($R$22:$R$24,$Q$22:$Q$24,Q59,0)","v":86.533333333333317}]
[null,null,null,null,null,null,null,null,null,null,null,null,null,null,null,null,-0.34,155.29800745088212,89.155555555555551]
[null,null,null,null,null,null,null,null,null,null,null,null,null,null,null,null,-0.35,169.02087410171018,91.777777777777757]
[null,null,null,null,null,null,null,null,null,null,null,null,null,null,null,null,-0.36,183.95635817247503,94.399999999999977]
[null,null,null,null,null,null,null,null,null,null,null,null,null,null,null,null,-0.37,200.21161227527659,97.022222222222197]
[null,null,null,null,null,null,null,null,null,null,null,null,null,null,null,null,-0.38,217.903257533957,99.644444444444431]
[null,null,null,null,null,null,null,null,null,null,null,null,null,null,null,null,-0.39,237.15822026659424,102.26666666666665]
[null,null,null,null,null,null,null,null,null,null,null,null,null,null,null,null,-0.4,258.11464260121767,104.88888888888887]
[null,null,null,null,null,null,null,null,null,null,null,null,null,null,null,null,-0.41,280.92287355783799,107.51111111111108]
[null,null,null,null,null,null,null,null,null,null,null,null,null,null,null,null,-0.42,305.74654770717279,110.13333333333331]
[null,null,null,null,null,null,null,null,null,null,null,null,null,null,null,null,-0.43,332.76375914476068,112.75555555555553]
[null,null,null,null,null,null,null,null,null,null,null,null,null,null,null,null,-0.44,362.16833920298285,115.37777777777775]
[null,null,null,null,null,null,null,null,null,null,null,null,null,null,null,null,-0.45,394.17124706776224,117.99999999999999]
[null,null,null,null,null,null,null,null,null,null,null,null,null,null,null,null,-0.46,429.00208327673522,120.62222222222221]
[null,null,null,null,null,null,null,null,null,null,null,null,null,null,null,null,-0.47,466.91073695727931,123.24444444444441]
[null,null,null,null,null,null,null,null,null,null,null,null,null,null,null,null,-0.48,508.16917862228996,125.86666666666663]
[null,null,null,null,null,null,null,null,null,null,null,null,null,null,null,null,-0.49,553.0734113858698,128.48888888888885]
[null,null,null,null,null,null,null,null,null,null,null,null,null,null,null,null,-0.5,601.94559459766924,131.11111111111109]
[null,null,null,null,null,null,null,null,null,null,null,null,null,null,null,null,-0.51,655.13635513160523,133.73333333333332]
[null,null,null,null,null,null,null,null,null,null,null,null,null,null,null,null,-0.52,713.02730291098419,136.35555555555553]
[null,null,null,null,null,null,null,null,null,null,null,null,null,null,null,null,-0.53,776.03376871732564,138.97777777777776]
[null,null,null,null,null,null,null,null,null,null,null,null,null,null,null,null,-0.54,844.60778392493023,141.6]
[null,null,null,null,null,null,null,null,null,null,null,null,null,null,null,null,-0.55000000000000004,919.24132353888274,144.2222222222222]
[null,null,null,null,null,null,null,null,null,null,null,null,null,null,null,null,-0.56000000000000005,1000.4698358032441,146.84444444444443]
[null,null,null,null,null,null,null,null,null,null,null,null,null,null,null,null,-0.56999999999999995,1088.8760837021161,149.46666666666661]
[null,null,null,null,null,null,null,null,null,null,null,null,null,null,null,null,-0.57999999999999996,{"$f":"GROWTH($R$22:$R$24,$Q$22:$Q$24,Q84,1)","v":1185.0943259139242},152.08888888888885]
[null,null,null,null,null,null,null,null,null,null,null,null,null,null,null,null,-0.59,1289.8148672145812,154.71111111111108]
[null,null,null,null,null,null,null,null,null,null,null,null,null,null,null,null,-0.6,1403.7890109758237,157.33333333333329]
[null,null,null,null,null,null,null,null,null,null,null,null,null,null,null,null,-0.61,1527.8344492897181,159.95555555555552]
[null,null,null,null,null,null,null,null,null,null,null,null,null,null,null,null,-0.62,1662.8411293900749,162.57777777777775]
[null,null,null,null,null,null,null,null,null,null,null,null,null,null,null,null,-0.63,1809.7776384586134,165.19999999999996]
[null,null,null,null,null,null,null,null,null,null,null,null,null,null,null,null,-0.64,1969.6981526227967,167.82222222222219]
[null,null,null,null,null,null,null,null,null,null,null,null,null,null,null,null,-0.65,2143.7500000000032,{"$f":"TREND($R$22:$R$24,$Q$22:$Q$24,Q91,0)","v":170.44444444444443}]
[null,null,null,null,null,null,null,null,null,null,null,null,null,null,null,null,-0.66,2333.1818920480518,173.06666666666663]
[null,null,null,null,null,null,null,null,null,null,null,null,null,null,null,null,-0.67,2539.3528822768158,175.68888888888887]
[null,null,null,null,null,null,null,null,null,null,null,null,null,null,null,null,-0.68,2763.7421165939554,178.3111111111111]
[null,null,null,null,null,null,null,null,null,null,null,null,null,null,null,null,-0.69,3007.9594452373472,180.93333333333328]
[null,null,null,null,null,null,null,null,null,null,null,null,null,null,null,null,-0.7,3273.7569724280715,183.55555555555551]
[null,null,null,null,null,null,null,null,null,null,null,null,null,null,null,null,-0.71,3563.0416266053498,186.17777777777772]
[null,null,null,null,null,null,null,null,null,null,null,null,null,null,null,null,-0.72,3877.8888414269545,188.79999999999995]
[null,null,null,null,null,null,null,null,null,null,null,null,null,null,null,null,-0.73,4220.5574456874938,191.42222222222219]
[null,null,null,null,null,null,null,null,null,null,null,null,null,null,null,null,-0.74,4593.5058689803536,194.04444444444439]
[null,null,null,null,null,null,null,null,null,null,null,null,null,null,null,null,-0.75,4999.4097793685823,196.66666666666663]
[null,null,null,null,null,null,null,null,null,null,null,null,null,null,null,null,-0.76,5441.1812796038321,199.28888888888886]
[null,null,null,null,null,null,null,null,null,null,null,null,null,null,null,null,-0.77,5921.9897996139953,201.91111111111107]
[null,null,null,null,null,null,null,null,null,null,null,null,null,null,null,null,-0.78,6445.2848351499179,204.5333333333333]
[null,null,null,null,null,null,null,null,null,null,null,null,null,null,null,null,-0.79,7014.8206957265047,207.15555555555554]
[null,null,null,null,null,null,null,null,null,null,null,null,null,null,null,null,-0.8,7634.6834394089665,209.77777777777774]
[null,null,null,null,null,null,null,null,null,null,null,null,null,null,null,null,-0.81,8309.3201876842595,212.39999999999998]
[null,null,null,null,null,null,null,null,null,null,null,null,null,null,null,null,-0.82,9043.5710307331574,215.02222222222215]
[null,null,null,null,null,null,null,null,null,null,null,null,null,null,null,null,-0.83,9842.7037520032318,217.64444444444439]
[null,null,null,null,null,null,null,null,null,null,null,null,null,null,null,null,-0.84,10712.451621209257,220.26666666666662]
[null,null,null,null,null,null,null,null,null,null,null,null,null,null,null,null,-0.85,11659.054526902017,222.88888888888883]
[null,null,null,null,null,null,null,null,null,null,null,null,null,null,null,null,-0.86,12689.303743705488,225.51111111111106]
[null,null,null,null,null,null,null,null,null,null,null,null,null,null,null,null,-0.87,13810.590655398801,228.1333333333333]
[null,null,null,null,null,null,null,null,null,null,null,null,null,null,null,null,-0.88,15030.959783400349,230.7555555555555]
[null,null,null,null,null,null,null,null,null,null,null,null,null,null,null,null,-0.89,16359.166501099548,233.37777777777774]

{"sheet":"Esforço","index":7,"n_rows":24,"n_cols":9,"rows_kept":24,"cut":false,"hidden":false,"merged":[[0,2,0,8]]}
[{"$f":"Resumo!A1","v":"Template V.1.6"},null,"Contagem de Pontos de Função - SISP 2.0\nEsforço"]
[]
["Produtividade (h/PFs) ----------->",null,8]
[null,null,null,"Engenharia de Requisitos","Design e Arquitetura","Implementação","Testes","Homologação","Implantação"]
["Requisito","Quant. PF","Total",{"$f":"Resumo!G18","v":0.25},{"$f":"Resumo!G19","v":0.1},{"$f":"Resumo!G20","v":0.4},{"$f":"Resumo!G21","v":0.15},{"$f":"Resumo!G22","v":0.05},{"$f":"Resumo!G23","v":0.05}]
[null,{"$f":"IF(Resumo!$B$5=\"Detalhada\",SUMIF('AFP - Detalhada'!$G$10:$G$384,Esforço!A6,'AFP - Detalhada'!$Q$10:$Q$384),IF(Resumo!B5=\"Estimativa\",SUMIF('AFP - Estimativa'!$G$10:$G$383,Esforço!A6,'AFP - Estimativa'!$J$10:$J$383)*(1+'AFP - Estimativa'!$C$6),IF(Resumo!B5=\"Indicativa\",SUMIF('AFP - Indicativa'!$E$10:$E$109,Esforço!A6,'AFP - Indicativa'!$I$10:$I$109)*(1+'AFP - Indicativa'!$E$6),0)))","v":0},{"$f":"ROUND(B6*$C$3,0)","v":0},{"$f":"ROUND($C6*D$5,0)","v":0},0,0,0,0,0]
[null,{"$f":"IF(Resumo!$B$5=\"Detalhada\",SUMIF('AFP - Detalhada'!$G$10:$G$384,Esforço!A7,'AFP - Detalhada'!$Q$10:$Q$384),IF(Resumo!B6=\"Estimativa\",SUMIF('AFP - Estimativa'!$G$10:$G$383,Esforço!A7,'AFP - Estimativa'!$J$10:$J$383)*(1+'AFP - Estimativa'!$C$6),IF(Resumo!B6=\"Indicativa\",SUMIF('AFP - Indicativa'!$E$10:$E$109,Esforço!A7,'AFP - Indicativa'!$I$10:$I$109)*(1+'AFP - Indicativa'!$E$6),0)))","v":0},{"$f":"ROUND(B7*$C$3,0)","v":0},0,0,0,0,0,0]
[null,{"$f":"IF(Resumo!$B$5=\"Detalhada\",SUMIF('AFP - Detalhada'!$G$10:$G$384,Esforço!A8,'AFP - Detalhada'!$Q$10:$Q$384),IF(Resumo!B7=\"Estimativa\",SUMIF('AFP - Estimativa'!$G$10:$G$383,Esforço!A8,'AFP - Estimativa'!$J$10:$J$383)*(1+'AFP - Estimativa'!$C$6),IF(Resumo!B7=\"Indicativa\",SUMIF('AFP - Indicativa'!$E$10:$E$109,Esforço!A8,'AFP - Indicativa'!$I$10:$I$109)*(1+'AFP - Indicativa'!$E$6),0)))","v":0},0,0,0,0,0,0,0]
[null,{"$f":"IF(Resumo!$B$5=\"Detalhada\",SUMIF('AFP - Detalhada'!$G$10:$G$384,Esforço!A9,'AFP - Detalhada'!$Q$10:$Q$384),IF(Resumo!B8=\"Estimativa\",SUMIF('AFP - Estimativa'!$G$10:$G$383,Esforço!A9,'AFP - Estimativa'!$J$10:$J$383)*(1+'AFP - Estimativa'!$C$6),IF(Resumo!B8=\"Indicativa\",SUMIF('AFP - Indicativa'!$E$10:$E$109,Esforço!A9,'AFP - Indicativa'!$I$10:$I$109)*(1+'AFP - Indicativa'!$E$6),0)))","v":0},0,0,0,0,0,0,0]
[null,{"$f":"IF(Resumo!$B$5=\"Detalhada\",SUMIF('AFP - Detalhada'!$G$10:$G$384,Esforço!A10,'AFP - Detalhada'!$Q$10:$Q$384),IF(Resumo!B9=\"Estimativa\",SUMIF('AFP - Estimativa'!$G$10:$G$383,Esforço!A10,'AFP - Estimativa'!$J$10:$J$383)*(1+'AFP - Estimativa'!$C$6),IF(Resumo!B9=\"Indicativa\",SUMIF('AFP - Indicativa'!$E$10:$E$109,Esforço!A10,'AFP - Indicativa'!$I$10:$I$109)*(1+'AFP - Indicativa'!$E$6),0)))","v":0},0,0,0,0,0,0,0]
[null,{"$f":"IF(Resumo!$B$5=\"Detalhada\",SUMIF('AFP - Detalhada'!$G$10:$G$384,Esforço!A11,'AFP - Detalhada'!$Q$10:$Q$384),IF(Resumo!B10=\"Estimativa\",SUMIF('AFP - Estimativa'!$G$10:$G$383,Esforço!A11,'AFP - Estimativa'!$J$10:$J$383)*(1+'AFP - Estimativa'!$C$6),IF(Resumo!B10=\"Indicativa\",SUMIF('AFP - Indicativa'!$E$10:$E$109,Esforço!A11,'AFP - Indicativa'!$I$10:$I$109)*(1+'AFP - Indicativa'!$E$6),0)))","v":0},0,0,0,0,0,0,0]
[null,{"$f":"IF(Resumo!$B$5=\"Detalhada\",SUMIF('AFP - Detalhada'!$G$10:$G$384,Esforço!A12,'AFP - Detalhada'!$Q$10:$Q$384),IF(Resumo!B11=\"Estimativa\",SUMIF('AFP - Estimativa'!$G$10:$G$383,Esforço!A12,'AFP - Estimativa'!$J$10:$J$383)*(1+'AFP - Estimativa'!$C$6),IF(Resumo!B11=\"Indicativa\",SUMIF('AFP - Indicativa'!$E$10:$E$109,Esforço!A12,'AFP - Indicativa'!$I$10:$I$109)*(1+'AFP - Indicativa'!$E$6),0)))","v":0},0,0,0,0,0,0,0]
[null,{"$f":"IF(Resumo!$B$5=\"Detalhada\",SUMIF('AFP - Detalhada'!$G$10:$G$384,Esforço!A13,'AFP - Detalhada'!$Q$10:$Q$384),IF(Resumo!B12=\"Estimativa\",SUMIF('AFP - Estimativa'!$G$10:$G$383,Esforço!A13,'AFP - Estimativa'!$J$10:$J$383)*(1+'AFP - Estimativa'!$C$6),IF(Resumo!B12=\"Indicativa\",SUMIF('AFP - Indicativa'!$E$10:$E$109,Esforço!A13,'AFP - Indicativa'!$I$10:$I$109)*(1+'AFP - Indicativa'!$E$6),0)))","v":0},0,0,0,0,0,0,0]
[null,{"$f":"IF(Resumo!$B$5=\"Detalhada\",SUMIF('AFP - Detalhada'!$G$10:$G$384,Esforço!A14,'AFP - Detalhada'!$Q$10:$Q$384),IF(Resumo!B13=\"Estimativa\",SUMIF('AFP - Estimativa'!$G$10:$G$383,Esforço!A14,'AFP - Estimativa'!$J$10:$J$383)*(1+'AFP - Estimativa'!$C$6),IF(Resumo!B13=\"Indicativa\",SUMIF('AFP - Indicativa'!$E$10:$E$109,Esforço!A14,'AFP - Indicativa'!$I$10:$I$109)*(1+'AFP - Indicativa'!$E$6),0)))","v":0},0,0,0,0,0,0,0]
[null,{"$f":"IF(Resumo!$B$5=\"Detalhada\",SUMIF('AFP - Detalhada'!$G$10:$G$384,Esforço!A15,'AFP - Detalhada'!$Q$10:$Q$384),IF(Resumo!B14=\"Estimativa\",SUMIF('AFP - Estimativa'!$G$10:$G$383,Esforço!A15,'AFP - Estimativa'!$J$10:$J$383)*(1+'AFP - Estimativa'!$C$6),IF(Resumo!B14=\"Indicativa\",SUMIF('AFP - Indicativa'!$E$10:$E$109,Esforço!A15,'AFP - Indicativa'!$I$10:$I$109)*(1+'AFP - Indicativa'!$E$6),0)))","v":0},0,0,0,0,0,0,0]
[null,{"$f":"IF(Resumo!$B$5=\"Detalhada\",SUMIF('AFP - Detalhada'!$G$10:$G$384,Esforço!A16,'AFP - Detalhada'!$Q$10:$Q$384),IF(Resumo!B15=\"Estimativa\",SUMIF('AFP - Estimativa'!$G$10:$G$383,Esforço!A16,'AFP - Estimativa'!$J$10:$J$383)*(1+'AFP - Estimativa'!$C$6),IF(Resumo!B15=\"Indicativa\",SUMIF('AFP - Indicativa'!$E$10:$E$109,Esforço!A16,'AFP - Indicativa'!$I$10:$I$109)*(1+'AFP - Indicativa'!$E$6),0)))","v":0},0,{"$f":"ROUND($C16*D$5,0)","v":0},0,0,0,0,0]
[null,{"$f":"IF(Resumo!$B$5=\"Detalhada\",SUMIF('AFP - Detalhada'!$G$10:$G$384,Esforço!A17,'AFP - Detalhada'!$Q$10:$Q$384),IF(Resumo!B16=\"Estimativa\",SUMIF('AFP - Estimativa'!$G$10:$G$383,Esforço!A17,'AFP - Estimativa'!$J$10:$J$383)*(1+'AFP - Estimativa'!$C$6),IF(Resumo!B16=\"Indicativa\",SUMIF('AFP - Indicativa'!$E$10:$E$109,Esforço!A17,'AFP - Indicativa'!$I$10:$I$109)*(1+'AFP - Indicativa'!$E$6),0)))","v":0},0,0,0,0,0,0,0]
[null,{"$f":"IF(Resumo!$B$5=\"Detalhada\",SUMIF('AFP - Detalhada'!$G$10:$G$384,Esforço!A18,'AFP - Detalhada'!$Q$10:$Q$384),IF(Resumo!B17=\"Estimativa\",SUMIF('AFP - Estimativa'!$G$10:$G$383,Esforço!A18,'AFP - Estimativa'!$J$10:$J$383)*(1+'AFP - Estimativa'!$C$6),IF(Resumo!B17=\"Indicativa\",SUMIF('AFP - Indicativa'!$E$10:$E$109,Esforço!A18,'AFP - Indicativa'!$I$10:$I$109)*(1+'AFP - Indicativa'!$E$6),0)))","v":0},0,0,0,0,0,0,0]
[null,{"$f":"IF(Resumo!$B$5=\"Detalhada\",SUMIF('AFP - Detalhada'!$G$10:$G$384,Esforço!A19,'AFP - Detalhada'!$Q$10:$Q$384),IF(Resumo!B18=\"Estimativa\",SUMIF('AFP - Estimativa'!$G$10:$G$383,Esforço!A19,'AFP - Estimativa'!$J$10:$J$383)*(1+'AFP - Estimativa'!$C$6),IF(Resumo!B18=\"Indicativa\",SUMIF('AFP - Indicativa'!$E$10:$E$109,Esforço!A19,'AFP - Indicativa'!$I$10:$I$109)*(1+'AFP - Indicativa'!$E$6),0)))","v":0},0,0,0,0,0,0,0]
[null,{"$f":"IF(Resumo!$B$5=\"Detalhada\",SUMIF('AFP - Detalhada'!$G$10:$G$384,Esforço!A20,'AFP - Detalhada'!$Q$10:$Q$384),IF(Resumo!B19=\"Estimativa\",SUMIF('AFP - Estimativa'!$G$10:$G$383,Esforço!A20,'AFP - Estimativa'!$J$10:$J$383)*(1+'AFP - Estimativa'!$C$6),IF(Resumo!B19=\"Indicativa\",SUMIF('AFP - Indicativa'!$E$10:$E$109,Esforço!A20,'AFP - Indicativa'!$I$10:$I$109)*(1+'AFP - Indicativa'!$E$6),0)))","v":0},0,0,0,0,0,0,0]
[null,{"$f":"IF(Resumo!$B$5=\"Detalhada\",SUMIF('AFP - Detalhada'!$G$10:$G$384,Esforço!A21,'AFP - Detalhada'!$Q$10:$Q$384),IF(Resumo!B20=\"Estimativa\",SUMIF('AFP - Estimativa'!$G$10:$G$383,Esforço!A21,'AFP - Estimativa'!$J$10:$J$383)*(1+'AFP - Estimativa'!$C$6),IF(Resumo!B20=\"Indicativa\",SUMIF('AFP - Indicativa'!$E$10:$E$109,Esforço!A21,'AFP - Indicativa'!$I$10:$I$109)*(1+'AFP - Indicativa'!$E$6),0)))","v":0},0,0,0,0,0,0,0]
[null,{"$f":"IF(Resumo!$B$5=\"Detalhada\",SUMIF('AFP - Detalhada'!$G$10:$G$384,Esforço!A22,'AFP - Detalhada'!$Q$10:$Q$384),IF(Resumo!B21=\"Estimativa\",SUMIF('AFP - Estimativa'!$G$10:$G$383,Esforço!A22,'AFP - Estimativa'!$J$10:$J$383)*(1+'AFP - Estimativa'!$C$6),IF(Resumo!B21=\"Indicativa\",SUMIF('AFP - Indicativa'!$E$10:$E$109,Esforço!A22,'AFP - Indicativa'!$I$10:$I$109)*(1+'AFP - Indicativa'!$E$6),0)))","v":0},0,0,0,0,0,0,0]
[null,{"$f":"IF(Resumo!$B$5=\"Detalhada\",SUMIF('AFP - Detalhada'!$G$10:$G$384,Esforço!A23,'AFP - Detalhada'!$Q$10:$Q$384),IF(Resumo!B22=\"Estimativa\",SUMIF('AFP - Estimativa'!$G$10:$G$383,Esforço!A23,'AFP - Estimativa'!$J$10:$J$383)*(1+'AFP - Estimativa'!$C$6),IF(Resumo!B22=\"Indicativa\",SUMIF('AFP - Indicativa'!$E$10:$E$109,Esforço!A23,'AFP - Indicativa'!$I$10:$I$109)*(1+'AFP - Indicativa'!$E$6),0)))","v":0},0,0,0,0,0,0,0]
["TOTAL",{"$f":"SUM(B6:B23)","v":0},{"$f":"SUM(C6:C23)","v":0},{"$f":"SUM(D6:D23)","v":0},0,0,0,0,0]

{"sheet":"Tipo Projeto","index":8,"n_rows":37,"n_cols":2,"rows_kept":37,"cut":false,"hidden":true,"merged":[[0,0,0,1]]}
["Identificação da Manutenção"]
["Tipo","Fator de Ajuste"]
["Aplicação",1]
["Novo sistema",1]
["Melhoria – Nova",1]
["Melhoria – Alterada - Basis",0.5]
["Melhoria – Alterada - não Basis (sem redocumentação)",0.75]
["Melhoria – Alterada - não Basis (com redocumentação)",0.9]
["Melhoria – Excluída",0.4]
["Migração de Dados",1]
["Corretiva – Basis (na garantia)",0]
["Corretiva – Basis (fora da garantia)",0.5]
["Corretiva – Basis (fora da garantia com redocumentação)",0.65]
["Corretiva – Não Basis",0.75]
["Corretiva – Não Basis com redocumentação",0.9]
["Mudança de Plataforma - Linguagem de Programação",1]
["Mudança de Plataforma - Banco de Dados Hierárquico",1]
["Mudança de Plataforma - Banco de Dados Relacional",0.3]
["Atualização de Versão – Linguagem de Programação",0.3]
["Atualização de Versão – Browser",0.3]
["Atualização de Versão – Banco de Dados",0.3]
["Manutenção em interface",0.6]
["Adaptação em Funcionalidades - Basis",0.5]
["Adaptação em Funcionalidades - Basis com redoc.",0.65]
["Adaptação em Funcionalidades - Não Basis",0.75]
["Adaptação em Funcionalidades - Não Basis com redoc.",0.9]
["Apuração Especial – Base Dados - sem Consulta Prévia",1]
["Apuração Especial – Base Dados – Consulta Prévia",1]
["Apuração Especial – Base Dados – com Consulta Prévia",0.6]
["Apuração Especial – Geração de Relatórios",1]
["Apuração Especial – Reexecução",0.1]
["Atualização Dados",0.1]
["Desenv., Manutenção e Publicação de Páginas Estáticas",0.6]
["Verificação Erros (documentação de teste inexistente)",0.2]
["Verificação Erros (documentação de teste existente)",0.15]
["Pontos Função Teste",0.15]
["Manutenção de Componente Interno Reusável",1]

{"sheet":"Tipo Sistema","index":9,"n_rows":8,"n_cols":3,"rows_kept":8,"cut":false,"hidden":true,"merged":[]}
["Tipo de Sistema","Observação","Expoente"]
["Sistema Comum – Mainframe","Desenvolvimento de sistema com alto grau de reuso ou manutenção evolutiva",0.33]
["Sistema Comum – WEB ou Cliente Servidor",null,0.35]
["Sistema OO","Se o projeto OO não for novidade para equipe, não tiver o desenvolvimento de componentes reusáveis, considerar sistema comum",0.36]
["Sistema Cliente/Servidor","Com alta complexidade arquitetural e integração com outros sistemas",0.37]
["Sistemas Gerenciais complexos","Com muitas integrações, Datawarehousing, Geoprocessamento, Workflow",0.39]
["Software Básico, Frameworks, Sistemas Comerciais",null,0.4]
["Software Militar",null,0.45]